{"text_format":"1","workbook":"xlsx","n_sheets":4,"sheets":["Inventory","Food_Reference","Help","Calcs"],"not_rendered":{"charts":0,"images":7,"macros":1,"external_links":0,"defined_names":3,"comments":0,"pivot_tables":0},"unopened":[],"bounds":{"document_bytes":16777216,"sheet_cells":100000,"rows_first":2000,"rows_last":500,"rows_between":2000,"halvings":0,"cell_chars":16384,"cell_head_chars":4096},"cells_cut":0,"cells_raw":0,"read":"whole","date_system":"1900"}

{"sheet":"Inventory","index":0,"n_rows":1000,"n_cols":9,"rows_kept":1000,"cut":false,"hidden":false,"merged":[]}
["Food Storage Inventory",null,{"$f":"TODAY()","v":"2017-12-13"}]
["Final Project - CEEN 270"]
["Mercedes, Ben, Bridger, Tyler"]
[]
[]
[]
[]
[]
["Food","Quantity ","Expiration Date (mmm-yy)",null,null,null,null,"Non-Food ","Quantity "]
[{"$f":"IF(Food_Reference!A3=\"\",\"\",Food_Reference!A3)","v":"Apple Slices"},{"$f":"IF(Food_Reference!B3=\"\",\"\",Food_Reference!B3)","v":5},{"$f":"IF(Food_Reference!C3=\"\",\"\",Food_Reference!C3)","v":"2019-12-11"},null,null,null,null,"Board Games",6]
[{"$f":"IF(Food_Reference!A4=\"\",\"\",Food_Reference!A4)","v":"Beans, Refried"},{"$f":"IF(Food_Reference!B4=\"\",\"\",Food_Reference!B4)","v":5},{"$f":"IF(Food_Reference!C4=\"\",\"\",Food_Reference!C4)","v":"2019-12-13"},null,null,null,null,"Compass",2]
[{"$f":"IF(Food_Reference!A5=\"\",\"\",Food_Reference!A5)","v":"Carrots"},{"$f":"IF(Food_Reference!B5=\"\",\"\",Food_Reference!B5)","v":5},{"$f":"IF(Food_Reference!C5=\"\",\"\",Food_Reference!C5)","v":"2019-12-13"},null,null,null,null,"Flashlights",4]
[{"$f":"IF(Food_Reference!A6=\"\",\"\",Food_Reference!A6)","v":"Macaroni"},{"$f":"IF(Food_Reference!B6=\"\",\"\",Food_Reference!B6)","v":5},{"$f":"IF(Food_Reference!C6=\"\",\"\",Food_Reference!C6)","v":"2019-12-13"},null,null,null,null,"Handgun",1]
[{"$f":"IF(Food_Reference!A7=\"\",\"\",Food_Reference!A7)","v":"Oats, Regular"},{"$f":"IF(Food_Reference!B7=\"\",\"\",Food_Reference!B7)","v":5},{"$f":"IF(Food_Reference!C7=\"\",\"\",Food_Reference!C7)","v":"2019-12-13"},null,null,null,null,"Jklsd",1]
[{"$f":"IF(Food_Reference!A8=\"\",\"\",Food_Reference!A8)","v":"Potatoes, Instant"},{"$f":"IF(Food_Reference!B8=\"\",\"\",Food_Reference!B8)","v":5},{"$f":"IF(Food_Reference!C8=\"\",\"\",Food_Reference!C8)","v":"2019-12-13"},null,null,null,null,"Jklsd",2]
[{"$f":"IF(Food_Reference!A9=\"\",\"\",Food_Reference!A9)","v":"Sugar"},{"$f":"IF(Food_Reference!B9=\"\",\"\",Food_Reference!B9)","v":5},{"$f":"IF(Food_Reference!C9=\"\",\"\",Food_Reference!C9)","v":"2019-12-13"},null,null,null,null,"Tool Set",1]
[{"$f":"IF(Food_Reference!A10=\"\",\"\",Food_Reference!A10)","v":"Wheat, Hard White"},{"$f":"IF(Food_Reference!B10=\"\",\"\",Food_Reference!B10)","v":5},{"$f":"IF(Food_Reference!C10=\"\",\"\",Food_Reference!C10)","v":"2019-12-13"},null,null,null,null,"Walkie-Talkies",4]
[{"$f":"IF(Food_Reference!A11=\"\",\"\",Food_Reference!A11)","v":"Beans, Great Northern"},{"$f":"IF(Food_Reference!B11=\"\",\"\",Food_Reference!B11)","v":5},{"$f":"IF(Food_Reference!C11=\"\",\"\",Food_Reference!C11)","v":"2023-01-04"},null,null,null,null,"Water Bottles",8]
[{"$f":"IF(Food_Reference!A12=\"\",\"\",Food_Reference!A12)","v":"Cocoa Mix"},{"$f":"IF(Food_Reference!B12=\"\",\"\",Food_Reference!B12)","v":5},{"$f":"IF(Food_Reference!C12=\"\",\"\",Food_Reference!C12)","v":"2023-01-04"},null,null,null,null,"Water Purification Tablets",4]
[{"$f":"IF(Food_Reference!A13=\"\",\"\",Food_Reference!A13)","v":"Granola (Pouch)"},{"$f":"IF(Food_Reference!B13=\"\",\"\",Food_Reference!B13)","v":5},{"$f":"IF(Food_Reference!C13=\"\",\"\",Food_Reference!C13)","v":"2023-01-04"}]
[{"$f":"IF(Food_Reference!A14=\"\",\"\",Food_Reference!A14)","v":"Milk, Nonfat Dry"},{"$f":"IF(Food_Reference!B14=\"\",\"\",Food_Reference!B14)","v":5},{"$f":"IF(Food_Reference!C14=\"\",\"\",Food_Reference!C14)","v":"2023-01-04"}]
[{"$f":"IF(Food_Reference!A15=\"\",\"\",Food_Reference!A15)","v":"Onions, Dry (#10 Can)"},{"$f":"IF(Food_Reference!B15=\"\",\"\",Food_Reference!B15)","v":5},{"$f":"IF(Food_Reference!C15=\"\",\"\",Food_Reference!C15)","v":"2023-01-04"}]
[{"$f":"IF(Food_Reference!A16=\"\",\"\",Food_Reference!A16)","v":"Peanut Butter"},{"$f":"IF(Food_Reference!B16=\"\",\"\",Food_Reference!B16)","v":5},{"$f":"IF(Food_Reference!C16=\"\",\"\",Food_Reference!C16)","v":"2023-01-04"}]
[{"$f":"IF(Food_Reference!A17=\"\",\"\",Food_Reference!A17)","v":"Rice, White"},{"$f":"IF(Food_Reference!B17=\"\",\"\",Food_Reference!B17)","v":5},{"$f":"IF(Food_Reference!C17=\"\",\"\",Food_Reference!C17)","v":"2023-01-04"}]
[{"$f":"IF(Food_Reference!A18=\"\",\"\",Food_Reference!A18)","v":"Wheat, Hard Red"},{"$f":"IF(Food_Reference!B18=\"\",\"\",Food_Reference!B18)","v":5},{"$f":"IF(Food_Reference!C18=\"\",\"\",Food_Reference!C18)","v":"2023-01-04"}]
[{"$f":"IF(Food_Reference!A19=\"\",\"\",Food_Reference!A19)","v":"Beans, Pinto"},{"$f":"IF(Food_Reference!B19=\"\",\"\",Food_Reference!B19)","v":5},{"$f":"IF(Food_Reference!C19=\"\",\"\",Food_Reference!C19)","v":"2024-03-06"}]
[{"$f":"IF(Food_Reference!A20=\"\",\"\",Food_Reference!A20)","v":"Berry Drink Mix"},{"$f":"IF(Food_Reference!B20=\"\",\"\",Food_Reference!B20)","v":5},{"$f":"IF(Food_Reference!C20=\"\",\"\",Food_Reference!C20)","v":"2024-03-06"}]
[{"$f":"IF(Food_Reference!A21=\"\",\"\",Food_Reference!A21)","v":"Honey (bottle)"},{"$f":"IF(Food_Reference!B21=\"\",\"\",Food_Reference!B21)","v":5},{"$f":"IF(Food_Reference!C21=\"\",\"\",Food_Reference!C21)","v":"2024-03-06"}]
[{"$f":"IF(Food_Reference!A22=\"\",\"\",Food_Reference!A22)","v":"Oats, Quick"},{"$f":"IF(Food_Reference!B22=\"\",\"\",Food_Reference!B22)","v":5},{"$f":"IF(Food_Reference!C22=\"\",\"\",Food_Reference!C22)","v":"2024-03-06"}]
[{"$f":"IF(Food_Reference!A23=\"\",\"\",Food_Reference!A23)","v":"Potatoes, Flakes"},{"$f":"IF(Food_Reference!B23=\"\",\"\",Food_Reference!B23)","v":5},{"$f":"IF(Food_Reference!C23=\"\",\"\",Food_Reference!C23)","v":"2024-03-06"}]
[{"$f":"IF(Food_Reference!A24=\"\",\"\",Food_Reference!A24)","v":"Spaghetti Bites"},{"$f":"IF(Food_Reference!B24=\"\",\"\",Food_Reference!B24)","v":5},{"$f":"IF(Food_Reference!C24=\"\",\"\",Food_Reference!C24)","v":"2024-03-06"}]
[{"$f":"IF(Food_Reference!A25=\"\",\"\",Food_Reference!A25)","v":""},{"$f":"IF(Food_Reference!B25=\"\",\"\",Food_Reference!B25)","v":""},{"$f":"IF(Food_Reference!C25=\"\",\"\",Food_Reference!C25)","v":""}]
[{"$f":"IF(Food_Reference!A26=\"\",\"\",Food_Reference!A26)","v":""},{"$f":"IF(Food_Reference!B26=\"\",\"\",Food_Reference!B26)","v":""},{"$f":"IF(Food_Reference!C26=\"\",\"\",Food_Reference!C26)","v":""}]
[{"$f":"IF(Food_Reference!A27=\"\",\"\",Food_Reference!A27)","v":""},{"$f":"IF(Food_Reference!B27=\"\",\"\",Food_Reference!B27)","v":""},{"$f":"IF(Food_Reference!C27=\"\",\"\",Food_Reference!C27)","v":""}]
[{"$f":"IF(Food_Reference!A28=\"\",\"\",Food_Reference!A28)","v":""},{"$f":"IF(Food_Reference!B28=\"\",\"\",Food_Reference!B28)","v":""},{"$f":"IF(Food_Reference!C28=\"\",\"\",Food_Reference!C28)","v":""}]
[{"$f":"IF(Food_Reference!A29=\"\",\"\",Food_Reference!A29)","v":""},{"$f":"IF(Food_Reference!B29=\"\",\"\",Food_Reference!B29)","v":""},{"$f":"IF(Food_Reference!C29=\"\",\"\",Food_Reference!C29)","v":""}]
[{"$f":"IF(Food_Reference!A30=\"\",\"\",Food_Reference!A30)","v":""},{"$f":"IF(Food_Reference!B30=\"\",\"\",Food_Reference!B30)","v":""},{"$f":"IF(Food_Reference!C30=\"\",\"\",Food_Reference!C30)","v":""}]
[{"$f":"IF(Food_Reference!A31=\"\",\"\",Food_Reference!A31)","v":""},{"$f":"IF(Food_Reference!B31=\"\",\"\",Food_Reference!B31)","v":""},{"$f":"IF(Food_Reference!C31=\"\",\"\",Food_Reference!C31)","v":""}]
[{"$f":"IF(Food_Reference!A32=\"\",\"\",Food_Reference!A32)","v":""},{"$f":"IF(Food_Reference!B32=\"\",\"\",Food_Reference!B32)","v":""},{"$f":"IF(Food_Reference!C32=\"\",\"\",Food_Reference!C32)","v":""}]
[{"$f":"IF(Food_Reference!A33=\"\",\"\",Food_Reference!A33)","v":""},{"$f":"IF(Food_Reference!B33=\"\",\"\",Food_Reference!B33)","v":""},{"$f":"IF(Food_Reference!C33=\"\",\"\",Food_Reference!C33)","v":""}]
[{"$f":"IF(Food_Reference!A34=\"\",\"\",Food_Reference!A34)","v":""},{"$f":"IF(Food_Reference!B34=\"\",\"\",Food_Reference!B34)","v":""},{"$f":"IF(Food_Reference!C34=\"\",\"\",Food_Reference!C34)","v":""}]
[{"$f":"IF(Food_Reference!A35=\"\",\"\",Food_Reference!A35)","v":""},{"$f":"IF(Food_Reference!B35=\"\",\"\",Food_Reference!B35)","v":""},{"$f":"IF(Food_Reference!C35=\"\",\"\",Food_Reference!C35)","v":""}]
[{"$f":"IF(Food_Reference!A36=\"\",\"\",Food_Reference!A36)","v":""},{"$f":"IF(Food_Reference!B36=\"\",\"\",Food_Reference!B36)","v":""},{"$f":"IF(Food_Reference!C36=\"\",\"\",Food_Reference!C36)","v":""}]
[{"$f":"IF(Food_Reference!A37=\"\",\"\",Food_Reference!A37)","v":""},{"$f":"IF(Food_Reference!B37=\"\",\"\",Food_Reference!B37)","v":""},{"$f":"IF(Food_Reference!C37=\"\",\"\",Food_Reference!C37)","v":""}]
[{"$f":"IF(Food_Reference!A38=\"\",\"\",Food_Reference!A38)","v":""},{"$f":"IF(Food_Reference!B38=\"\",\"\",Food_Reference!B38)","v":""},{"$f":"IF(Food_Reference!C38=\"\",\"\",Food_Reference!C38)","v":""}]
[{"$f":"IF(Food_Reference!A39=\"\",\"\",Food_Reference!A39)","v":""},{"$f":"IF(Food_Reference!B39=\"\",\"\",Food_Reference!B39)","v":""},{"$f":"IF(Food_Reference!C39=\"\",\"\",Food_Reference!C39)","v":""}]
[{"$f":"IF(Food_Reference!A40=\"\",\"\",Food_Reference!A40)","v":""},{"$f":"IF(Food_Reference!B40=\"\",\"\",Food_Reference!B40)","v":""},{"$f":"IF(Food_Reference!C40=\"\",\"\",Food_Reference!C40)","v":""}]
[{"$f":"IF(Food_Reference!A41=\"\",\"\",Food_Reference!A41)","v":""},{"$f":"IF(Food_Reference!B41=\"\",\"\",Food_Reference!B41)","v":""},{"$f":"IF(Food_Reference!C41=\"\",\"\",Food_Reference!C41)","v":""}]
[{"$f":"IF(Food_Reference!A42=\"\",\"\",Food_Reference!A42)","v":""},{"$f":"IF(Food_Reference!B42=\"\",\"\",Food_Reference!B42)","v":""},{"$f":"IF(Food_Reference!C42=\"\",\"\",Food_Reference!C42)","v":""}]
[{"$f":"IF(Food_Reference!A43=\"\",\"\",Food_Reference!A43)","v":""},{"$f":"IF(Food_Reference!B43=\"\",\"\",Food_Reference!B43)","v":""},{"$f":"IF(Food_Reference!C43=\"\",\"\",Food_Reference!C43)","v":""}]
[{"$f":"IF(Food_Reference!A44=\"\",\"\",Food_Reference!A44)","v":""},{"$f":"IF(Food_Reference!B44=\"\",\"\",Food_Reference!B44)","v":""},{"$f":"IF(Food_Reference!C44=\"\",\"\",Food_Reference!C44)","v":""}]
[{"$f":"IF(Food_Reference!A45=\"\",\"\",Food_Reference!A45)","v":""},{"$f":"IF(Food_Reference!B45=\"\",\"\",Food_Reference!B45)","v":""},{"$f":"IF(Food_Reference!C45=\"\",\"\",Food_Reference!C45)","v":""}]
[{"$f":"IF(Food_Reference!A46=\"\",\"\",Food_Reference!A46)","v":""},{"$f":"IF(Food_Reference!B46=\"\",\"\",Food_Reference!B46)","v":""},{"$f":"IF(Food_Reference!C46=\"\",\"\",Food_Reference!C46)","v":""}]
[{"$f":"IF(Food_Reference!A47=\"\",\"\",Food_Reference!A47)","v":""},{"$f":"IF(Food_Reference!B47=\"\",\"\",Food_Reference!B47)","v":""},{"$f":"IF(Food_Reference!C47=\"\",\"\",Food_Reference!C47)","v":""}]
[{"$f":"IF(Food_Reference!A48=\"\",\"\",Food_Reference!A48)","v":""},{"$f":"IF(Food_Reference!B48=\"\",\"\",Food_Reference!B48)","v":""},{"$f":"IF(Food_Reference!C48=\"\",\"\",Food_Reference!C48)","v":""}]
[{"$f":"IF(Food_Reference!A49=\"\",\"\",Food_Reference!A49)","v":""},{"$f":"IF(Food_Reference!B49=\"\",\"\",Food_Reference!B49)","v":""},{"$f":"IF(Food_Reference!C49=\"\",\"\",Food_Reference!C49)","v":""}]
[{"$f":"IF(Food_Reference!A50=\"\",\"\",Food_Reference!A50)","v":""},{"$f":"IF(Food_Reference!B50=\"\",\"\",Food_Reference!B50)","v":""},{"$f":"IF(Food_Reference!C50=\"\",\"\",Food_Reference!C50)","v":""}]
[{"$f":"IF(Food_Reference!A51=\"\",\"\",Food_Reference!A51)","v":""},{"$f":"IF(Food_Reference!B51=\"\",\"\",Food_Reference!B51)","v":""},{"$f":"IF(Food_Reference!C51=\"\",\"\",Food_Reference!C51)","v":""}]
[{"$f":"IF(Food_Reference!A52=\"\",\"\",Food_Reference!A52)","v":""},{"$f":"IF(Food_Reference!B52=\"\",\"\",Food_Reference!B52)","v":""},{"$f":"IF(Food_Reference!C52=\"\",\"\",Food_Reference!C52)","v":""}]
[{"$f":"IF(Food_Reference!A53=\"\",\"\",Food_Reference!A53)","v":""},{"$f":"IF(Food_Reference!B53=\"\",\"\",Food_Reference!B53)","v":""},{"$f":"IF(Food_Reference!C53=\"\",\"\",Food_Reference!C53)","v":""}]
[{"$f":"IF(Food_Reference!A54=\"\",\"\",Food_Reference!A54)","v":""},{"$f":"IF(Food_Reference!B54=\"\",\"\",Food_Reference!B54)","v":""},{"$f":"IF(Food_Reference!C54=\"\",\"\",Food_Reference!C54)","v":""}]
[{"$f":"IF(Food_Reference!A55=\"\",\"\",Food_Reference!A55)","v":""},{"$f":"IF(Food_Reference!B55=\"\",\"\",Food_Reference!B55)","v":""},{"$f":"IF(Food_Reference!C55=\"\",\"\",Food_Reference!C55)","v":""}]
[{"$f":"IF(Food_Reference!A56=\"\",\"\",Food_Reference!A56)","v":""},{"$f":"IF(Food_Reference!B56=\"\",\"\",Food_Reference!B56)","v":""},{"$f":"IF(Food_Reference!C56=\"\",\"\",Food_Reference!C56)","v":""}]
[{"$f":"IF(Food_Reference!A57=\"\",\"\",Food_Reference!A57)","v":""},{"$f":"IF(Food_Reference!B57=\"\",\"\",Food_Reference!B57)","v":""},{"$f":"IF(Food_Reference!C57=\"\",\"\",Food_Reference!C57)","v":""}]
[{"$f":"IF(Food_Reference!A58=\"\",\"\",Food_Reference!A58)","v":""},{"$f":"IF(Food_Reference!B58=\"\",\"\",Food_Reference!B58)","v":""},{"$f":"IF(Food_Reference!C58=\"\",\"\",Food_Reference!C58)","v":""}]
[{"$f":"IF(Food_Reference!A59=\"\",\"\",Food_Reference!A59)","v":""},{"$f":"IF(Food_Reference!B59=\"\",\"\",Food_Reference!B59)","v":""},{"$f":"IF(Food_Reference!C59=\"\",\"\",Food_Reference!C59)","v":""}]
[{"$f":"IF(Food_Reference!A60=\"\",\"\",Food_Reference!A60)","v":""},{"$f":"IF(Food_Reference!B60=\"\",\"\",Food_Reference!B60)","v":""},{"$f":"IF(Food_Reference!C60=\"\",\"\",Food_Reference!C60)","v":""}]
[{"$f":"IF(Food_Reference!A61=\"\",\"\",Food_Reference!A61)","v":""},{"$f":"IF(Food_Reference!B61=\"\",\"\",Food_Reference!B61)","v":""},{"$f":"IF(Food_Reference!C61=\"\",\"\",Food_Reference!C61)","v":""}]
[{"$f":"IF(Food_Reference!A62=\"\",\"\",Food_Reference!A62)","v":""},{"$f":"IF(Food_Reference!B62=\"\",\"\",Food_Reference!B62)","v":""},{"$f":"IF(Food_Reference!C62=\"\",\"\",Food_Reference!C62)","v":""}]
[{"$f":"IF(Food_Reference!A63=\"\",\"\",Food_Reference!A63)","v":""},{"$f":"IF(Food_Reference!B63=\"\",\"\",Food_Reference!B63)","v":""},{"$f":"IF(Food_Reference!C63=\"\",\"\",Food_Reference!C63)","v":""}]
[{"$f":"IF(Food_Reference!A64=\"\",\"\",Food_Reference!A64)","v":""},{"$f":"IF(Food_Reference!B64=\"\",\"\",Food_Reference!B64)","v":""},{"$f":"IF(Food_Reference!C64=\"\",\"\",Food_Reference!C64)","v":""}]
[{"$f":"IF(Food_Reference!A65=\"\",\"\",Food_Reference!A65)","v":""},{"$f":"IF(Food_Reference!B65=\"\",\"\",Food_Reference!B65)","v":""},{"$f":"IF(Food_Reference!C65=\"\",\"\",Food_Reference!C65)","v":""}]
[{"$f":"IF(Food_Reference!A66=\"\",\"\",Food_Reference!A66)","v":""},{"$f":"IF(Food_Reference!B66=\"\",\"\",Food_Reference!B66)","v":""},{"$f":"IF(Food_Reference!C66=\"\",\"\",Food_Reference!C66)","v":""}]
[{"$f":"IF(Food_Reference!A67=\"\",\"\",Food_Reference!A67)","v":""},{"$f":"IF(Food_Reference!B67=\"\",\"\",Food_Reference!B67)","v":""},{"$f":"IF(Food_Reference!C67=\"\",\"\",Food_Reference!C67)","v":""}]
[{"$f":"IF(Food_Reference!A68=\"\",\"\",Food_Reference!A68)","v":""},{"$f":"IF(Food_Reference!B68=\"\",\"\",Food_Reference!B68)","v":""},{"$f":"IF(Food_Reference!C68=\"\",\"\",Food_Reference!C68)","v":""}]
[{"$f":"IF(Food_Reference!A69=\"\",\"\",Food_Reference!A69)","v":""},{"$f":"IF(Food_Reference!B69=\"\",\"\",Food_Reference!B69)","v":""},{"$f":"IF(Food_Reference!C69=\"\",\"\",Food_Reference!C69)","v":""}]
[{"$f":"IF(Food_Reference!A70=\"\",\"\",Food_Reference!A70)","v":""},{"$f":"IF(Food_Reference!B70=\"\",\"\",Food_Reference!B70)","v":""},{"$f":"IF(Food_Reference!C70=\"\",\"\",Food_Reference!C70)","v":""}]
[{"$f":"IF(Food_Reference!A71=\"\",\"\",Food_Reference!A71)","v":""},{"$f":"IF(Food_Reference!B71=\"\",\"\",Food_Reference!B71)","v":""},{"$f":"IF(Food_Reference!C71=\"\",\"\",Food_Reference!C71)","v":""}]
[{"$f":"IF(Food_Reference!A72=\"\",\"\",Food_Reference!A72)","v":""},{"$f":"IF(Food_Reference!B72=\"\",\"\",Food_Reference!B72)","v":""},{"$f":"IF(Food_Reference!C72=\"\",\"\",Food_Reference!C72)","v":""}]
[{"$f":"IF(Food_Reference!A73=\"\",\"\",Food_Reference!A73)","v":""},{"$f":"IF(Food_Reference!B73=\"\",\"\",Food_Reference!B73)","v":""},{"$f":"IF(Food_Reference!C73=\"\",\"\",Food_Reference!C73)","v":""}]
[{"$f":"IF(Food_Reference!A74=\"\",\"\",Food_Reference!A74)","v":""},{"$f":"IF(Food_Reference!B74=\"\",\"\",Food_Reference!B74)","v":""},{"$f":"IF(Food_Reference!C74=\"\",\"\",Food_Reference!C74)","v":""}]
[{"$f":"IF(Food_Reference!A75=\"\",\"\",Food_Reference!A75)","v":""},{"$f":"IF(Food_Reference!B75=\"\",\"\",Food_Reference!B75)","v":""},{"$f":"IF(Food_Reference!C75=\"\",\"\",Food_Reference!C75)","v":""}]
[{"$f":"IF(Food_Reference!A76=\"\",\"\",Food_Reference!A76)","v":""},{"$f":"IF(Food_Reference!B76=\"\",\"\",Food_Reference!B76)","v":""},{"$f":"IF(Food_Reference!C76=\"\",\"\",Food_Reference!C76)","v":""}]
[{"$f":"IF(Food_Reference!A77=\"\",\"\",Food_Reference!A77)","v":""},{"$f":"IF(Food_Reference!B77=\"\",\"\",Food_Reference!B77)","v":""},{"$f":"IF(Food_Reference!C77=\"\",\"\",Food_Reference!C77)","v":""}]
[{"$f":"IF(Food_Reference!A78=\"\",\"\",Food_Reference!A78)","v":""},{"$f":"IF(Food_Reference!B78=\"\",\"\",Food_Reference!B78)","v":""},{"$f":"IF(Food_Reference!C78=\"\",\"\",Food_Reference!C78)","v":""}]
[{"$f":"IF(Food_Reference!A79=\"\",\"\",Food_Reference!A79)","v":""},{"$f":"IF(Food_Reference!B79=\"\",\"\",Food_Reference!B79)","v":""},{"$f":"IF(Food_Reference!C79=\"\",\"\",Food_Reference!C79)","v":""}]
[{"$f":"IF(Food_Reference!A80=\"\",\"\",Food_Reference!A80)","v":""},{"$f":"IF(Food_Reference!B80=\"\",\"\",Food_Reference!B80)","v":""},{"$f":"IF(Food_Reference!C80=\"\",\"\",Food_Reference!C80)","v":""}]
[{"$f":"IF(Food_Reference!A81=\"\",\"\",Food_Reference!A81)","v":""},{"$f":"IF(Food_Reference!B81=\"\",\"\",Food_Reference!B81)","v":""},{"$f":"IF(Food_Reference!C81=\"\",\"\",Food_Reference!C81)","v":""}]
[{"$f":"IF(Food_Reference!A82=\"\",\"\",Food_Reference!A82)","v":""},{"$f":"IF(Food_Reference!B82=\"\",\"\",Food_Reference!B82)","v":""},{"$f":"IF(Food_Reference!C82=\"\",\"\",Food_Reference!C82)","v":""}]
[{"$f":"IF(Food_Reference!A83=\"\",\"\",Food_Reference!A83)","v":""},{"$f":"IF(Food_Reference!B83=\"\",\"\",Food_Reference!B83)","v":""},{"$f":"IF(Food_Reference!C83=\"\",\"\",Food_Reference!C83)","v":""}]
[{"$f":"IF(Food_Reference!A84=\"\",\"\",Food_Reference!A84)","v":""},{"$f":"IF(Food_Reference!B84=\"\",\"\",Food_Reference!B84)","v":""},{"$f":"IF(Food_Reference!C84=\"\",\"\",Food_Reference!C84)","v":""}]
[{"$f":"IF(Food_Reference!A85=\"\",\"\",Food_Reference!A85)","v":""},{"$f":"IF(Food_Reference!B85=\"\",\"\",Food_Reference!B85)","v":""},{"$f":"IF(Food_Reference!C85=\"\",\"\",Food_Reference!C85)","v":""}]
[{"$f":"IF(Food_Reference!A86=\"\",\"\",Food_Reference!A86)","v":""},{"$f":"IF(Food_Reference!B86=\"\",\"\",Food_Reference!B86)","v":""},{"$f":"IF(Food_Reference!C86=\"\",\"\",Food_Reference!C86)","v":""}]
[{"$f":"IF(Food_Reference!A87=\"\",\"\",Food_Reference!A87)","v":""},{"$f":"IF(Food_Reference!B87=\"\",\"\",Food_Reference!B87)","v":""},{"$f":"IF(Food_Reference!C87=\"\",\"\",Food_Reference!C87)","v":""}]
[{"$f":"IF(Food_Reference!A88=\"\",\"\",Food_Reference!A88)","v":""},{"$f":"IF(Food_Reference!B88=\"\",\"\",Food_Reference!B88)","v":""},{"$f":"IF(Food_Reference!C88=\"\",\"\",Food_Reference!C88)","v":""}]
[{"$f":"IF(Food_Reference!A89=\"\",\"\",Food_Reference!A89)","v":""},{"$f":"IF(Food_Reference!B89=\"\",\"\",Food_Reference!B89)","v":""},{"$f":"IF(Food_Reference!C89=\"\",\"\",Food_Reference!C89)","v":""}]
[{"$f":"IF(Food_Reference!A90=\"\",\"\",Food_Reference!A90)","v":""},{"$f":"IF(Food_Reference!B90=\"\",\"\",Food_Reference!B90)","v":""},{"$f":"IF(Food_Reference!C90=\"\",\"\",Food_Reference!C90)","v":""}]
[{"$f":"IF(Food_Reference!A91=\"\",\"\",Food_Reference!A91)","v":""},{"$f":"IF(Food_Reference!B91=\"\",\"\",Food_Reference!B91)","v":""},{"$f":"IF(Food_Reference!C91=\"\",\"\",Food_Reference!C91)","v":""}]
[{"$f":"IF(Food_Reference!A92=\"\",\"\",Food_Reference!A92)","v":""},{"$f":"IF(Food_Reference!B92=\"\",\"\",Food_Reference!B92)","v":""},{"$f":"IF(Food_Reference!C92=\"\",\"\",Food_Reference!C92)","v":""}]
[{"$f":"IF(Food_Reference!A93=\"\",\"\",Food_Reference!A93)","v":""},{"$f":"IF(Food_Reference!B93=\"\",\"\",Food_Reference!B93)","v":""},{"$f":"IF(Food_Reference!C93=\"\",\"\",Food_Reference!C93)","v":""}]
[{"$f":"IF(Food_Reference!A94=\"\",\"\",Food_Reference!A94)","v":""},{"$f":"IF(Food_Reference!B94=\"\",\"\",Food_Reference!B94)","v":""},{"$f":"IF(Food_Reference!C94=\"\",\"\",Food_Reference!C94)","v":""}]
[{"$f":"IF(Food_Reference!A95=\"\",\"\",Food_Reference!A95)","v":""},{"$f":"IF(Food_Reference!B95=\"\",\"\",Food_Reference!B95)","v":""},{"$f":"IF(Food_Reference!C95=\"\",\"\",Food_Reference!C95)","v":""}]
[{"$f":"IF(Food_Reference!A96=\"\",\"\",Food_Reference!A96)","v":""},{"$f":"IF(Food_Reference!B96=\"\",\"\",Food_Reference!B96)","v":""},{"$f":"IF(Food_Reference!C96=\"\",\"\",Food_Reference!C96)","v":""}]
[{"$f":"IF(Food_Reference!A97=\"\",\"\",Food_Reference!A97)","v":""},{"$f":"IF(Food_Reference!B97=\"\",\"\",Food_Reference!B97)","v":""},{"$f":"IF(Food_Reference!C97=\"\",\"\",Food_Reference!C97)","v":""}]
[{"$f":"IF(Food_Reference!A98=\"\",\"\",Food_Reference!A98)","v":""},{"$f":"IF(Food_Reference!B98=\"\",\"\",Food_Reference!B98)","v":""},{"$f":"IF(Food_Reference!C98=\"\",\"\",Food_Reference!C98)","v":""}]
[{"$f":"IF(Food_Reference!A99=\"\",\"\",Food_Reference!A99)","v":""},{"$f":"IF(Food_Reference!B99=\"\",\"\",Food_Reference!B99)","v":""},{"$f":"IF(Food_Reference!C99=\"\",\"\",Food_Reference!C99)","v":""}]
[{"$f":"IF(Food_Reference!A100=\"\",\"\",Food_Reference!A100)","v":""},{"$f":"IF(Food_Reference!B100=\"\",\"\",Food_Reference!B100)","v":""},{"$f":"IF(Food_Reference!C100=\"\",\"\",Food_Reference!C100)","v":""}]
[{"$f":"IF(Food_Reference!A101=\"\",\"\",Food_Reference!A101)","v":""},{"$f":"IF(Food_Reference!B101=\"\",\"\",Food_Reference!B101)","v":""},{"$f":"IF(Food_Reference!C101=\"\",\"\",Food_Reference!C101)","v":""}]
[{"$f":"IF(Food_Reference!A102=\"\",\"\",Food_Reference!A102)","v":""},{"$f":"IF(Food_Reference!B102=\"\",\"\",Food_Reference!B102)","v":""},{"$f":"IF(Food_Reference!C102=\"\",\"\",Food_Reference!C102)","v":""}]
[{"$f":"IF(Food_Reference!A103=\"\",\"\",Food_Reference!A103)","v":""},{"$f":"IF(Food_Reference!B103=\"\",\"\",Food_Reference!B103)","v":""},{"$f":"IF(Food_Reference!C103=\"\",\"\",Food_Reference!C103)","v":""}]
[{"$f":"IF(Food_Reference!A104=\"\",\"\",Food_Reference!A104)","v":""},{"$f":"IF(Food_Reference!B104=\"\",\"\",Food_Reference!B104)","v":""},{"$f":"IF(Food_Reference!C104=\"\",\"\",Food_Reference!C104)","v":""}]
[{"$f":"IF(Food_Reference!A105=\"\",\"\",Food_Reference!A105)","v":""},{"$f":"IF(Food_Reference!B105=\"\",\"\",Food_Reference!B105)","v":""},{"$f":"IF(Food_Reference!C105=\"\",\"\",Food_Reference!C105)","v":""}]
[{"$f":"IF(Food_Reference!A106=\"\",\"\",Food_Reference!A106)","v":""},{"$f":"IF(Food_Reference!B106=\"\",\"\",Food_Reference!B106)","v":""},{"$f":"IF(Food_Reference!C106=\"\",\"\",Food_Reference!C106)","v":""}]
[{"$f":"IF(Food_Reference!A107=\"\",\"\",Food_Reference!A107)","v":""},{"$f":"IF(Food_Reference!B107=\"\",\"\",Food_Reference!B107)","v":""},{"$f":"IF(Food_Reference!C107=\"\",\"\",Food_Reference!C107)","v":""}]
[{"$f":"IF(Food_Reference!A108=\"\",\"\",Food_Reference!A108)","v":""},{"$f":"IF(Food_Reference!B108=\"\",\"\",Food_Reference!B108)","v":""},{"$f":"IF(Food_Reference!C108=\"\",\"\",Food_Reference!C108)","v":""}]
[{"$f":"IF(Food_Reference!A109=\"\",\"\",Food_Reference!A109)","v":""},{"$f":"IF(Food_Reference!B109=\"\",\"\",Food_Reference!B109)","v":""},{"$f":"IF(Food_Reference!C109=\"\",\"\",Food_Reference!C109)","v":""}]
[{"$f":"IF(Food_Reference!A110=\"\",\"\",Food_Reference!A110)","v":""},{"$f":"IF(Food_Reference!B110=\"\",\"\",Food_Reference!B110)","v":""},{"$f":"IF(Food_Reference!C110=\"\",\"\",Food_Reference!C110)","v":""}]
[{"$f":"IF(Food_Reference!A111=\"\",\"\",Food_Reference!A111)","v":""},{"$f":"IF(Food_Reference!B111=\"\",\"\",Food_Reference!B111)","v":""},{"$f":"IF(Food_Reference!C111=\"\",\"\",Food_Reference!C111)","v":""}]
[{"$f":"IF(Food_Reference!A112=\"\",\"\",Food_Reference!A112)","v":""},{"$f":"IF(Food_Reference!B112=\"\",\"\",Food_Reference!B112)","v":""},{"$f":"IF(Food_Reference!C112=\"\",\"\",Food_Reference!C112)","v":""}]
[{"$f":"IF(Food_Reference!A113=\"\",\"\",Food_Reference!A113)","v":""},{"$f":"IF(Food_Reference!B113=\"\",\"\",Food_Reference!B113)","v":""},{"$f":"IF(Food_Reference!C113=\"\",\"\",Food_Reference!C113)","v":""}]
[{"$f":"IF(Food_Reference!A114=\"\",\"\",Food_Reference!A114)","v":""},{"$f":"IF(Food_Reference!B114=\"\",\"\",Food_Reference!B114)","v":""},{"$f":"IF(Food_Reference!C114=\"\",\"\",Food_Reference!C114)","v":""}]
[{"$f":"IF(Food_Reference!A115=\"\",\"\",Food_Reference!A115)","v":""},{"$f":"IF(Food_Reference!B115=\"\",\"\",Food_Reference!B115)","v":""},{"$f":"IF(Food_Reference!C115=\"\",\"\",Food_Reference!C115)","v":""}]
[{"$f":"IF(Food_Reference!A116=\"\",\"\",Food_Reference!A116)","v":""},{"$f":"IF(Food_Reference!B116=\"\",\"\",Food_Reference!B116)","v":""},{"$f":"IF(Food_Reference!C116=\"\",\"\",Food_Reference!C116)","v":""}]
[{"$f":"IF(Food_Reference!A117=\"\",\"\",Food_Reference!A117)","v":""},{"$f":"IF(Food_Reference!B117=\"\",\"\",Food_Reference!B117)","v":""},{"$f":"IF(Food_Reference!C117=\"\",\"\",Food_Reference!C117)","v":""}]
[{"$f":"IF(Food_Reference!A118=\"\",\"\",Food_Reference!A118)","v":""},{"$f":"IF(Food_Reference!B118=\"\",\"\",Food_Reference!B118)","v":""},{"$f":"IF(Food_Reference!C118=\"\",\"\",Food_Reference!C118)","v":""}]
[{"$f":"IF(Food_Reference!A119=\"\",\"\",Food_Reference!A119)","v":""},{"$f":"IF(Food_Reference!B119=\"\",\"\",Food_Reference!B119)","v":""},{"$f":"IF(Food_Reference!C119=\"\",\"\",Food_Reference!C119)","v":""}]
[{"$f":"IF(Food_Reference!A120=\"\",\"\",Food_Reference!A120)","v":""},{"$f":"IF(Food_Reference!B120=\"\",\"\",Food_Reference!B120)","v":""},{"$f":"IF(Food_Reference!C120=\"\",\"\",Food_Reference!C120)","v":""}]
[{"$f":"IF(Food_Reference!A121=\"\",\"\",Food_Reference!A121)","v":""},{"$f":"IF(Food_Reference!B121=\"\",\"\",Food_Reference!B121)","v":""},{"$f":"IF(Food_Reference!C121=\"\",\"\",Food_Reference!C121)","v":""}]
[{"$f":"IF(Food_Reference!A122=\"\",\"\",Food_Reference!A122)","v":""},{"$f":"IF(Food_Reference!B122=\"\",\"\",Food_Reference!B122)","v":""},{"$f":"IF(Food_Reference!C122=\"\",\"\",Food_Reference!C122)","v":""}]
[{"$f":"IF(Food_Reference!A123=\"\",\"\",Food_Reference!A123)","v":""},{"$f":"IF(Food_Reference!B123=\"\",\"\",Food_Reference!B123)","v":""},{"$f":"IF(Food_Reference!C123=\"\",\"\",Food_Reference!C123)","v":""}]
[{"$f":"IF(Food_Reference!A124=\"\",\"\",Food_Reference!A124)","v":""},{"$f":"IF(Food_Reference!B124=\"\",\"\",Food_Reference!B124)","v":""},{"$f":"IF(Food_Reference!C124=\"\",\"\",Food_Reference!C124)","v":""}]
[{"$f":"IF(Food_Reference!A125=\"\",\"\",Food_Reference!A125)","v":""},{"$f":"IF(Food_Reference!B125=\"\",\"\",Food_Reference!B125)","v":""},{"$f":"IF(Food_Reference!C125=\"\",\"\",Food_Reference!C125)","v":""}]
[{"$f":"IF(Food_Reference!A126=\"\",\"\",Food_Reference!A126)","v":""},{"$f":"IF(Food_Reference!B126=\"\",\"\",Food_Reference!B126)","v":""},{"$f":"IF(Food_Reference!C126=\"\",\"\",Food_Reference!C126)","v":""}]
[{"$f":"IF(Food_Reference!A127=\"\",\"\",Food_Reference!A127)","v":""},{"$f":"IF(Food_Reference!B127=\"\",\"\",Food_Reference!B127)","v":""},{"$f":"IF(Food_Reference!C127=\"\",\"\",Food_Reference!C127)","v":""}]
[{"$f":"IF(Food_Reference!A128=\"\",\"\",Food_Reference!A128)","v":""},{"$f":"IF(Food_Reference!B128=\"\",\"\",Food_Reference!B128)","v":""},{"$f":"IF(Food_Reference!C128=\"\",\"\",Food_Reference!C128)","v":""}]
[{"$f":"IF(Food_Reference!A129=\"\",\"\",Food_Reference!A129)","v":""},{"$f":"IF(Food_Reference!B129=\"\",\"\",Food_Reference!B129)","v":""},{"$f":"IF(Food_Reference!C129=\"\",\"\",Food_Reference!C129)","v":""}]
[{"$f":"IF(Food_Reference!A130=\"\",\"\",Food_Reference!A130)","v":""},{"$f":"IF(Food_Reference!B130=\"\",\"\",Food_Reference!B130)","v":""},{"$f":"IF(Food_Reference!C130=\"\",\"\",Food_Reference!C130)","v":""}]
[{"$f":"IF(Food_Reference!A131=\"\",\"\",Food_Reference!A131)","v":""},{"$f":"IF(Food_Reference!B131=\"\",\"\",Food_Reference!B131)","v":""},{"$f":"IF(Food_Reference!C131=\"\",\"\",Food_Reference!C131)","v":""}]
[{"$f":"IF(Food_Reference!A132=\"\",\"\",Food_Reference!A132)","v":""},{"$f":"IF(Food_Reference!B132=\"\",\"\",Food_Reference!B132)","v":""},{"$f":"IF(Food_Reference!C132=\"\",\"\",Food_Reference!C132)","v":""}]
[{"$f":"IF(Food_Reference!A133=\"\",\"\",Food_Reference!A133)","v":""},{"$f":"IF(Food_Reference!B133=\"\",\"\",Food_Reference!B133)","v":""},{"$f":"IF(Food_Reference!C133=\"\",\"\",Food_Reference!C133)","v":""}]
[{"$f":"IF(Food_Reference!A134=\"\",\"\",Food_Reference!A134)","v":""},{"$f":"IF(Food_Reference!B134=\"\",\"\",Food_Reference!B134)","v":""},{"$f":"IF(Food_Reference!C134=\"\",\"\",Food_Reference!C134)","v":""}]
[{"$f":"IF(Food_Reference!A135=\"\",\"\",Food_Reference!A135)","v":""},{"$f":"IF(Food_Reference!B135=\"\",\"\",Food_Reference!B135)","v":""},{"$f":"IF(Food_Reference!C135=\"\",\"\",Food_Reference!C135)","v":""}]
[{"$f":"IF(Food_Reference!A136=\"\",\"\",Food_Reference!A136)","v":""},{"$f":"IF(Food_Reference!B136=\"\",\"\",Food_Reference!B136)","v":""},{"$f":"IF(Food_Reference!C136=\"\",\"\",Food_Reference!C136)","v":""}]
[{"$f":"IF(Food_Reference!A137=\"\",\"\",Food_Reference!A137)","v":""},{"$f":"IF(Food_Reference!B137=\"\",\"\",Food_Reference!B137)","v":""},{"$f":"IF(Food_Reference!C137=\"\",\"\",Food_Reference!C137)","v":""}]
[{"$f":"IF(Food_Reference!A138=\"\",\"\",Food_Reference!A138)","v":""},{"$f":"IF(Food_Reference!B138=\"\",\"\",Food_Reference!B138)","v":""},{"$f":"IF(Food_Reference!C138=\"\",\"\",Food_Reference!C138)","v":""}]
[{"$f":"IF(Food_Reference!A139=\"\",\"\",Food_Reference!A139)","v":""},{"$f":"IF(Food_Reference!B139=\"\",\"\",Food_Reference!B139)","v":""},{"$f":"IF(Food_Reference!C139=\"\",\"\",Food_Reference!C139)","v":""}]
[{"$f":"IF(Food_Reference!A140=\"\",\"\",Food_Reference!A140)","v":""},{"$f":"IF(Food_Reference!B140=\"\",\"\",Food_Reference!B140)","v":""},{"$f":"IF(Food_Reference!C140=\"\",\"\",Food_Reference!C140)","v":""}]
[{"$f":"IF(Food_Reference!A141=\"\",\"\",Food_Reference!A141)","v":""},{"$f":"IF(Food_Reference!B141=\"\",\"\",Food_Reference!B141)","v":""},{"$f":"IF(Food_Reference!C141=\"\",\"\",Food_Reference!C141)","v":""}]
[{"$f":"IF(Food_Reference!A142=\"\",\"\",Food_Reference!A142)","v":""},{"$f":"IF(Food_Reference!B142=\"\",\"\",Food_Reference!B142)","v":""},{"$f":"IF(Food_Reference!C142=\"\",\"\",Food_Reference!C142)","v":""}]
[{"$f":"IF(Food_Reference!A143=\"\",\"\",Food_Reference!A143)","v":""},{"$f":"IF(Food_Reference!B143=\"\",\"\",Food_Reference!B143)","v":""},{"$f":"IF(Food_Reference!C143=\"\",\"\",Food_Reference!C143)","v":""}]
[{"$f":"IF(Food_Reference!A144=\"\",\"\",Food_Reference!A144)","v":""},{"$f":"IF(Food_Reference!B144=\"\",\"\",Food_Reference!B144)","v":""},{"$f":"IF(Food_Reference!C144=\"\",\"\",Food_Reference!C144)","v":""}]
[{"$f":"IF(Food_Reference!A145=\"\",\"\",Food_Reference!A145)","v":""},{"$f":"IF(Food_Reference!B145=\"\",\"\",Food_Reference!B145)","v":""},{"$f":"IF(Food_Reference!C145=\"\",\"\",Food_Reference!C145)","v":""}]
[{"$f":"IF(Food_Reference!A146=\"\",\"\",Food_Reference!A146)","v":""},{"$f":"IF(Food_Reference!B146=\"\",\"\",Food_Reference!B146)","v":""},{"$f":"IF(Food_Reference!C146=\"\",\"\",Food_Reference!C146)","v":""}]
[{"$f":"IF(Food_Reference!A147=\"\",\"\",Food_Reference!A147)","v":""},{"$f":"IF(Food_Reference!B147=\"\",\"\",Food_Reference!B147)","v":""},{"$f":"IF(Food_Reference!C147=\"\",\"\",Food_Reference!C147)","v":""}]
[{"$f":"IF(Food_Reference!A148=\"\",\"\",Food_Reference!A148)","v":""},{"$f":"IF(Food_Reference!B148=\"\",\"\",Food_Reference!B148)","v":""},{"$f":"IF(Food_Reference!C148=\"\",\"\",Food_Reference!C148)","v":""}]
[{"$f":"IF(Food_Reference!A149=\"\",\"\",Food_Reference!A149)","v":""},{"$f":"IF(Food_Reference!B149=\"\",\"\",Food_Reference!B149)","v":""},{"$f":"IF(Food_Reference!C149=\"\",\"\",Food_Reference!C149)","v":""}]
[{"$f":"IF(Food_Reference!A150=\"\",\"\",Food_Reference!A150)","v":""},{"$f":"IF(Food_Reference!B150=\"\",\"\",Food_Reference!B150)","v":""},{"$f":"IF(Food_Reference!C150=\"\",\"\",Food_Reference!C150)","v":""}]
[{"$f":"IF(Food_Reference!A151=\"\",\"\",Food_Reference!A151)","v":""},{"$f":"IF(Food_Reference!B151=\"\",\"\",Food_Reference!B151)","v":""},{"$f":"IF(Food_Reference!C151=\"\",\"\",Food_Reference!C151)","v":""}]
[{"$f":"IF(Food_Reference!A152=\"\",\"\",Food_Reference!A152)","v":""},{"$f":"IF(Food_Reference!B152=\"\",\"\",Food_Reference!B152)","v":""},{"$f":"IF(Food_Reference!C152=\"\",\"\",Food_Reference!C152)","v":""}]
[{"$f":"IF(Food_Reference!A153=\"\",\"\",Food_Reference!A153)","v":""},{"$f":"IF(Food_Reference!B153=\"\",\"\",Food_Reference!B153)","v":""},{"$f":"IF(Food_Reference!C153=\"\",\"\",Food_Reference!C153)","v":""}]
[{"$f":"IF(Food_Reference!A154=\"\",\"\",Food_Reference!A154)","v":""},{"$f":"IF(Food_Reference!B154=\"\",\"\",Food_Reference!B154)","v":""},{"$f":"IF(Food_Reference!C154=\"\",\"\",Food_Reference!C154)","v":""}]
[{"$f":"IF(Food_Reference!A155=\"\",\"\",Food_Reference!A155)","v":""},{"$f":"IF(Food_Reference!B155=\"\",\"\",Food_Reference!B155)","v":""},{"$f":"IF(Food_Reference!C155=\"\",\"\",Food_Reference!C155)","v":""}]
[{"$f":"IF(Food_Reference!A156=\"\",\"\",Food_Reference!A156)","v":""},{"$f":"IF(Food_Reference!B156=\"\",\"\",Food_Reference!B156)","v":""},{"$f":"IF(Food_Reference!C156=\"\",\"\",Food_Reference!C156)","v":""}]
[{"$f":"IF(Food_Reference!A157=\"\",\"\",Food_Reference!A157)","v":""},{"$f":"IF(Food_Reference!B157=\"\",\"\",Food_Reference!B157)","v":""},{"$f":"IF(Food_Reference!C157=\"\",\"\",Food_Reference!C157)","v":""}]
[{"$f":"IF(Food_Reference!A158=\"\",\"\",Food_Reference!A158)","v":""},{"$f":"IF(Food_Reference!B158=\"\",\"\",Food_Reference!B158)","v":""},{"$f":"IF(Food_Reference!C158=\"\",\"\",Food_Reference!C158)","v":""}]
[{"$f":"IF(Food_Reference!A159=\"\",\"\",Food_Reference!A159)","v":""},{"$f":"IF(Food_Reference!B159=\"\",\"\",Food_Reference!B159)","v":""},{"$f":"IF(Food_Reference!C159=\"\",\"\",Food_Reference!C159)","v":""}]
[{"$f":"IF(Food_Reference!A160=\"\",\"\",Food_Reference!A160)","v":""},{"$f":"IF(Food_Reference!B160=\"\",\"\",Food_Reference!B160)","v":""},{"$f":"IF(Food_Reference!C160=\"\",\"\",Food_Reference!C160)","v":""}]
[{"$f":"IF(Food_Reference!A161=\"\",\"\",Food_Reference!A161)","v":""},{"$f":"IF(Food_Reference!B161=\"\",\"\",Food_Reference!B161)","v":""},{"$f":"IF(Food_Reference!C161=\"\",\"\",Food_Reference!C161)","v":""}]
[{"$f":"IF(Food_Reference!A162=\"\",\"\",Food_Reference!A162)","v":""},{"$f":"IF(Food_Reference!B162=\"\",\"\",Food_Reference!B162)","v":""},{"$f":"IF(Food_Reference!C162=\"\",\"\",Food_Reference!C162)","v":""}]
[{"$f":"IF(Food_Reference!A163=\"\",\"\",Food_Reference!A163)","v":""},{"$f":"IF(Food_Reference!B163=\"\",\"\",Food_Reference!B163)","v":""},{"$f":"IF(Food_Reference!C163=\"\",\"\",Food_Reference!C163)","v":""}]
[{"$f":"IF(Food_Reference!A164=\"\",\"\",Food_Reference!A164)","v":""},{"$f":"IF(Food_Reference!B164=\"\",\"\",Food_Reference!B164)","v":""},{"$f":"IF(Food_Reference!C164=\"\",\"\",Food_Reference!C164)","v":""}]
[{"$f":"IF(Food_Reference!A165=\"\",\"\",Food_Reference!A165)","v":""},{"$f":"IF(Food_Reference!B165=\"\",\"\",Food_Reference!B165)","v":""},{"$f":"IF(Food_Reference!C165=\"\",\"\",Food_Reference!C165)","v":""}]
[{"$f":"IF(Food_Reference!A166=\"\",\"\",Food_Reference!A166)","v":""},{"$f":"IF(Food_Reference!B166=\"\",\"\",Food_Reference!B166)","v":""},{"$f":"IF(Food_Reference!C166=\"\",\"\",Food_Reference!C166)","v":""}]
[{"$f":"IF(Food_Reference!A167=\"\",\"\",Food_Reference!A167)","v":""},{"$f":"IF(Food_Reference!B167=\"\",\"\",Food_Reference!B167)","v":""},{"$f":"IF(Food_Reference!C167=\"\",\"\",Food_Reference!C167)","v":""}]
[{"$f":"IF(Food_Reference!A168=\"\",\"\",Food_Reference!A168)","v":""},{"$f":"IF(Food_Reference!B168=\"\",\"\",Food_Reference!B168)","v":""},{"$f":"IF(Food_Reference!C168=\"\",\"\",Food_Reference!C168)","v":""}]
[{"$f":"IF(Food_Reference!A169=\"\",\"\",Food_Reference!A169)","v":""},{"$f":"IF(Food_Reference!B169=\"\",\"\",Food_Reference!B169)","v":""},{"$f":"IF(Food_Reference!C169=\"\",\"\",Food_Reference!C169)","v":""}]
[{"$f":"IF(Food_Reference!A170=\"\",\"\",Food_Reference!A170)","v":""},{"$f":"IF(Food_Reference!B170=\"\",\"\",Food_Reference!B170)","v":""},{"$f":"IF(Food_Reference!C170=\"\",\"\",Food_Reference!C170)","v":""}]
[{"$f":"IF(Food_Reference!A171=\"\",\"\",Food_Reference!A171)","v":""},{"$f":"IF(Food_Reference!B171=\"\",\"\",Food_Reference!B171)","v":""},{"$f":"IF(Food_Reference!C171=\"\",\"\",Food_Reference!C171)","v":""}]
[{"$f":"IF(Food_Reference!A172=\"\",\"\",Food_Reference!A172)","v":""},{"$f":"IF(Food_Reference!B172=\"\",\"\",Food_Reference!B172)","v":""},{"$f":"IF(Food_Reference!C172=\"\",\"\",Food_Reference!C172)","v":""}]
[{"$f":"IF(Food_Reference!A173=\"\",\"\",Food_Reference!A173)","v":""},{"$f":"IF(Food_Reference!B173=\"\",\"\",Food_Reference!B173)","v":""},{"$f":"IF(Food_Reference!C173=\"\",\"\",Food_Reference!C173)","v":""}]
[{"$f":"IF(Food_Reference!A174=\"\",\"\",Food_Reference!A174)","v":""},{"$f":"IF(Food_Reference!B174=\"\",\"\",Food_Reference!B174)","v":""},{"$f":"IF(Food_Reference!C174=\"\",\"\",Food_Reference!C174)","v":""}]
[{"$f":"IF(Food_Reference!A175=\"\",\"\",Food_Reference!A175)","v":""},{"$f":"IF(Food_Reference!B175=\"\",\"\",Food_Reference!B175)","v":""},{"$f":"IF(Food_Reference!C175=\"\",\"\",Food_Reference!C175)","v":""}]
[{"$f":"IF(Food_Reference!A176=\"\",\"\",Food_Reference!A176)","v":""},{"$f":"IF(Food_Reference!B176=\"\",\"\",Food_Reference!B176)","v":""},{"$f":"IF(Food_Reference!C176=\"\",\"\",Food_Reference!C176)","v":""}]
[{"$f":"IF(Food_Reference!A177=\"\",\"\",Food_Reference!A177)","v":""},{"$f":"IF(Food_Reference!B177=\"\",\"\",Food_Reference!B177)","v":""},{"$f":"IF(Food_Reference!C177=\"\",\"\",Food_Reference!C177)","v":""}]
[{"$f":"IF(Food_Reference!A178=\"\",\"\",Food_Reference!A178)","v":""},{"$f":"IF(Food_Reference!B178=\"\",\"\",Food_Reference!B178)","v":""},{"$f":"IF(Food_Reference!C178=\"\",\"\",Food_Reference!C178)","v":""}]
[{"$f":"IF(Food_Reference!A179=\"\",\"\",Food_Reference!A179)","v":""},{"$f":"IF(Food_Reference!B179=\"\",\"\",Food_Reference!B179)","v":""},{"$f":"IF(Food_Reference!C179=\"\",\"\",Food_Reference!C179)","v":""}]
[{"$f":"IF(Food_Reference!A180=\"\",\"\",Food_Reference!A180)","v":""},{"$f":"IF(Food_Reference!B180=\"\",\"\",Food_Reference!B180)","v":""},{"$f":"IF(Food_Reference!C180=\"\",\"\",Food_Reference!C180)","v":""}]
[{"$f":"IF(Food_Reference!A181=\"\",\"\",Food_Reference!A181)","v":""},{"$f":"IF(Food_Reference!B181=\"\",\"\",Food_Reference!B181)","v":""},{"$f":"IF(Food_Reference!C181=\"\",\"\",Food_Reference!C181)","v":""}]
[{"$f":"IF(Food_Reference!A182=\"\",\"\",Food_Reference!A182)","v":""},{"$f":"IF(Food_Reference!B182=\"\",\"\",Food_Reference!B182)","v":""},{"$f":"IF(Food_Reference!C182=\"\",\"\",Food_Reference!C182)","v":""}]
[{"$f":"IF(Food_Reference!A183=\"\",\"\",Food_Reference!A183)","v":""},{"$f":"IF(Food_Reference!B183=\"\",\"\",Food_Reference!B183)","v":""},{"$f":"IF(Food_Reference!C183=\"\",\"\",Food_Reference!C183)","v":""}]
[{"$f":"IF(Food_Reference!A184=\"\",\"\",Food_Reference!A184)","v":""},{"$f":"IF(Food_Reference!B184=\"\",\"\",Food_Reference!B184)","v":""},{"$f":"IF(Food_Reference!C184=\"\",\"\",Food_Reference!C184)","v":""}]
[{"$f":"IF(Food_Reference!A185=\"\",\"\",Food_Reference!A185)","v":""},{"$f":"IF(Food_Reference!B185=\"\",\"\",Food_Reference!B185)","v":""},{"$f":"IF(Food_Reference!C185=\"\",\"\",Food_Reference!C185)","v":""}]
[{"$f":"IF(Food_Reference!A186=\"\",\"\",Food_Reference!A186)","v":""},{"$f":"IF(Food_Reference!B186=\"\",\"\",Food_Reference!B186)","v":""},{"$f":"IF(Food_Reference!C186=\"\",\"\",Food_Reference!C186)","v":""}]
[{"$f":"IF(Food_Reference!A187=\"\",\"\",Food_Reference!A187)","v":""},{"$f":"IF(Food_Reference!B187=\"\",\"\",Food_Reference!B187)","v":""},{"$f":"IF(Food_Reference!C187=\"\",\"\",Food_Reference!C187)","v":""}]
[{"$f":"IF(Food_Reference!A188=\"\",\"\",Food_Reference!A188)","v":""},{"$f":"IF(Food_Reference!B188=\"\",\"\",Food_Reference!B188)","v":""},{"$f":"IF(Food_Reference!C188=\"\",\"\",Food_Reference!C188)","v":""}]
[{"$f":"IF(Food_Reference!A189=\"\",\"\",Food_Reference!A189)","v":""},{"$f":"IF(Food_Reference!B189=\"\",\"\",Food_Reference!B189)","v":""},{"$f":"IF(Food_Reference!C189=\"\",\"\",Food_Reference!C189)","v":""}]
[{"$f":"IF(Food_Reference!A190=\"\",\"\",Food_Reference!A190)","v":""},{"$f":"IF(Food_Reference!B190=\"\",\"\",Food_Reference!B190)","v":""},{"$f":"IF(Food_Reference!C190=\"\",\"\",Food_Reference!C190)","v":""}]
[{"$f":"IF(Food_Reference!A191=\"\",\"\",Food_Reference!A191)","v":""},{"$f":"IF(Food_Reference!B191=\"\",\"\",Food_Reference!B191)","v":""},{"$f":"IF(Food_Reference!C191=\"\",\"\",Food_Reference!C191)","v":""}]
[{"$f":"IF(Food_Reference!A192=\"\",\"\",Food_Reference!A192)","v":""},{"$f":"IF(Food_Reference!B192=\"\",\"\",Food_Reference!B192)","v":""},{"$f":"IF(Food_Reference!C192=\"\",\"\",Food_Reference!C192)","v":""}]
[{"$f":"IF(Food_Reference!A193=\"\",\"\",Food_Reference!A193)","v":""},{"$f":"IF(Food_Reference!B193=\"\",\"\",Food_Reference!B193)","v":""},{"$f":"IF(Food_Reference!C193=\"\",\"\",Food_Reference!C193)","v":""}]
[{"$f":"IF(Food_Reference!A194=\"\",\"\",Food_Reference!A194)","v":""},{"$f":"IF(Food_Reference!B194=\"\",\"\",Food_Reference!B194)","v":""},{"$f":"IF(Food_Reference!C194=\"\",\"\",Food_Reference!C194)","v":""}]
[{"$f":"IF(Food_Reference!A195=\"\",\"\",Food_Reference!A195)","v":""},{"$f":"IF(Food_Reference!B195=\"\",\"\",Food_Reference!B195)","v":""},{"$f":"IF(Food_Reference!C195=\"\",\"\",Food_Reference!C195)","v":""}]
[{"$f":"IF(Food_Reference!A196=\"\",\"\",Food_Reference!A196)","v":""},{"$f":"IF(Food_Reference!B196=\"\",\"\",Food_Reference!B196)","v":""},{"$f":"IF(Food_Reference!C196=\"\",\"\",Food_Reference!C196)","v":""}]
[{"$f":"IF(Food_Reference!A197=\"\",\"\",Food_Reference!A197)","v":""},{"$f":"IF(Food_Reference!B197=\"\",\"\",Food_Reference!B197)","v":""},{"$f":"IF(Food_Reference!C197=\"\",\"\",Food_Reference!C197)","v":""}]
[{"$f":"IF(Food_Reference!A198=\"\",\"\",Food_Reference!A198)","v":""},{"$f":"IF(Food_Reference!B198=\"\",\"\",Food_Reference!B198)","v":""},{"$f":"IF(Food_Reference!C198=\"\",\"\",Food_Reference!C198)","v":""}]
[{"$f":"IF(Food_Reference!A199=\"\",\"\",Food_Reference!A199)","v":""},{"$f":"IF(Food_Reference!B199=\"\",\"\",Food_Reference!B199)","v":""},{"$f":"IF(Food_Reference!C199=\"\",\"\",Food_Reference!C199)","v":""}]
[{"$f":"IF(Food_Reference!A200=\"\",\"\",Food_Reference!A200)","v":""},{"$f":"IF(Food_Reference!B200=\"\",\"\",Food_Reference!B200)","v":""},{"$f":"IF(Food_Reference!C200=\"\",\"\",Food_Reference!C200)","v":""}]
[{"$f":"IF(Food_Reference!A201=\"\",\"\",Food_Reference!A201)","v":""},{"$f":"IF(Food_Reference!B201=\"\",\"\",Food_Reference!B201)","v":""},{"$f":"IF(Food_Reference!C201=\"\",\"\",Food_Reference!C201)","v":""}]
[{"$f":"IF(Food_Reference!A202=\"\",\"\",Food_Reference!A202)","v":""},{"$f":"IF(Food_Reference!B202=\"\",\"\",Food_Reference!B202)","v":""},{"$f":"IF(Food_Reference!C202=\"\",\"\",Food_Reference!C202)","v":""}]
[{"$f":"IF(Food_Reference!A203=\"\",\"\",Food_Reference!A203)","v":""},{"$f":"IF(Food_Reference!B203=\"\",\"\",Food_Reference!B203)","v":""},{"$f":"IF(Food_Reference!C203=\"\",\"\",Food_Reference!C203)","v":""}]
[{"$f":"IF(Food_Reference!A204=\"\",\"\",Food_Reference!A204)","v":""},{"$f":"IF(Food_Reference!B204=\"\",\"\",Food_Reference!B204)","v":""},{"$f":"IF(Food_Reference!C204=\"\",\"\",Food_Reference!C204)","v":""}]
[{"$f":"IF(Food_Reference!A205=\"\",\"\",Food_Reference!A205)","v":""},{"$f":"IF(Food_Reference!B205=\"\",\"\",Food_Reference!B205)","v":""},{"$f":"IF(Food_Reference!C205=\"\",\"\",Food_Reference!C205)","v":""}]
[{"$f":"IF(Food_Reference!A206=\"\",\"\",Food_Reference!A206)","v":""},{"$f":"IF(Food_Reference!B206=\"\",\"\",Food_Reference!B206)","v":""},{"$f":"IF(Food_Reference!C206=\"\",\"\",Food_Reference!C206)","v":""}]
[{"$f":"IF(Food_Reference!A207=\"\",\"\",Food_Reference!A207)","v":""},{"$f":"IF(Food_Reference!B207=\"\",\"\",Food_Reference!B207)","v":""},{"$f":"IF(Food_Reference!C207=\"\",\"\",Food_Reference!C207)","v":""}]
[{"$f":"IF(Food_Reference!A208=\"\",\"\",Food_Reference!A208)","v":""},{"$f":"IF(Food_Reference!B208=\"\",\"\",Food_Reference!B208)","v":""},{"$f":"IF(Food_Reference!C208=\"\",\"\",Food_Reference!C208)","v":""}]
[{"$f":"IF(Food_Reference!A209=\"\",\"\",Food_Reference!A209)","v":""},{"$f":"IF(Food_Reference!B209=\"\",\"\",Food_Reference!B209)","v":""},{"$f":"IF(Food_Reference!C209=\"\",\"\",Food_Reference!C209)","v":""}]
[{"$f":"IF(Food_Reference!A210=\"\",\"\",Food_Reference!A210)","v":""},{"$f":"IF(Food_Reference!B210=\"\",\"\",Food_Reference!B210)","v":""},{"$f":"IF(Food_Reference!C210=\"\",\"\",Food_Reference!C210)","v":""}]
[{"$f":"IF(Food_Reference!A211=\"\",\"\",Food_Reference!A211)","v":""},{"$f":"IF(Food_Reference!B211=\"\",\"\",Food_Reference!B211)","v":""},{"$f":"IF(Food_Reference!C211=\"\",\"\",Food_Reference!C211)","v":""}]
[{"$f":"IF(Food_Reference!A212=\"\",\"\",Food_Reference!A212)","v":""},{"$f":"IF(Food_Reference!B212=\"\",\"\",Food_Reference!B212)","v":""},{"$f":"IF(Food_Reference!C212=\"\",\"\",Food_Reference!C212)","v":""}]
[{"$f":"IF(Food_Reference!A213=\"\",\"\",Food_Reference!A213)","v":""},{"$f":"IF(Food_Reference!B213=\"\",\"\",Food_Reference!B213)","v":""},{"$f":"IF(Food_Reference!C213=\"\",\"\",Food_Reference!C213)","v":""}]
[{"$f":"IF(Food_Reference!A214=\"\",\"\",Food_Reference!A214)","v":""},{"$f":"IF(Food_Reference!B214=\"\",\"\",Food_Reference!B214)","v":""},{"$f":"IF(Food_Reference!C214=\"\",\"\",Food_Reference!C214)","v":""}]
[{"$f":"IF(Food_Reference!A215=\"\",\"\",Food_Reference!A215)","v":""},{"$f":"IF(Food_Reference!B215=\"\",\"\",Food_Reference!B215)","v":""},{"$f":"IF(Food_Reference!C215=\"\",\"\",Food_Reference!C215)","v":""}]
[{"$f":"IF(Food_Reference!A216=\"\",\"\",Food_Reference!A216)","v":""},{"$f":"IF(Food_Reference!B216=\"\",\"\",Food_Reference!B216)","v":""},{"$f":"IF(Food_Reference!C216=\"\",\"\",Food_Reference!C216)","v":""}]
[{"$f":"IF(Food_Reference!A217=\"\",\"\",Food_Reference!A217)","v":""},{"$f":"IF(Food_Reference!B217=\"\",\"\",Food_Reference!B217)","v":""},{"$f":"IF(Food_Reference!C217=\"\",\"\",Food_Reference!C217)","v":""}]
[{"$f":"IF(Food_Reference!A218=\"\",\"\",Food_Reference!A218)","v":""},{"$f":"IF(Food_Reference!B218=\"\",\"\",Food_Reference!B218)","v":""},{"$f":"IF(Food_Reference!C218=\"\",\"\",Food_Reference!C218)","v":""}]
[{"$f":"IF(Food_Reference!A219=\"\",\"\",Food_Reference!A219)","v":""},{"$f":"IF(Food_Reference!B219=\"\",\"\",Food_Reference!B219)","v":""},{"$f":"IF(Food_Reference!C219=\"\",\"\",Food_Reference!C219)","v":""}]
[{"$f":"IF(Food_Reference!A220=\"\",\"\",Food_Reference!A220)","v":""},{"$f":"IF(Food_Reference!B220=\"\",\"\",Food_Reference!B220)","v":""},{"$f":"IF(Food_Reference!C220=\"\",\"\",Food_Reference!C220)","v":""}]
[{"$f":"IF(Food_Reference!A221=\"\",\"\",Food_Reference!A221)","v":""},{"$f":"IF(Food_Reference!B221=\"\",\"\",Food_Reference!B221)","v":""},{"$f":"IF(Food_Reference!C221=\"\",\"\",Food_Reference!C221)","v":""}]
[{"$f":"IF(Food_Reference!A222=\"\",\"\",Food_Reference!A222)","v":""},{"$f":"IF(Food_Reference!B222=\"\",\"\",Food_Reference!B222)","v":""},{"$f":"IF(Food_Reference!C222=\"\",\"\",Food_Reference!C222)","v":""}]
[{"$f":"IF(Food_Reference!A223=\"\",\"\",Food_Reference!A223)","v":""},{"$f":"IF(Food_Reference!B223=\"\",\"\",Food_Reference!B223)","v":""},{"$f":"IF(Food_Reference!C223=\"\",\"\",Food_Reference!C223)","v":""}]
[{"$f":"IF(Food_Reference!A224=\"\",\"\",Food_Reference!A224)","v":""},{"$f":"IF(Food_Reference!B224=\"\",\"\",Food_Reference!B224)","v":""},{"$f":"IF(Food_Reference!C224=\"\",\"\",Food_Reference!C224)","v":""}]
[{"$f":"IF(Food_Reference!A225=\"\",\"\",Food_Reference!A225)","v":""},{"$f":"IF(Food_Reference!B225=\"\",\"\",Food_Reference!B225)","v":""},{"$f":"IF(Food_Reference!C225=\"\",\"\",Food_Reference!C225)","v":""}]
[{"$f":"IF(Food_Reference!A226=\"\",\"\",Food_Reference!A226)","v":""},{"$f":"IF(Food_Reference!B226=\"\",\"\",Food_Reference!B226)","v":""},{"$f":"IF(Food_Reference!C226=\"\",\"\",Food_Reference!C226)","v":""}]
[{"$f":"IF(Food_Reference!A227=\"\",\"\",Food_Reference!A227)","v":""},{"$f":"IF(Food_Reference!B227=\"\",\"\",Food_Reference!B227)","v":""},{"$f":"IF(Food_Reference!C227=\"\",\"\",Food_Reference!C227)","v":""}]
[{"$f":"IF(Food_Reference!A228=\"\",\"\",Food_Reference!A228)","v":""},{"$f":"IF(Food_Reference!B228=\"\",\"\",Food_Reference!B228)","v":""},{"$f":"IF(Food_Reference!C228=\"\",\"\",Food_Reference!C228)","v":""}]
[{"$f":"IF(Food_Reference!A229=\"\",\"\",Food_Reference!A229)","v":""},{"$f":"IF(Food_Reference!B229=\"\",\"\",Food_Reference!B229)","v":""},{"$f":"IF(Food_Reference!C229=\"\",\"\",Food_Reference!C229)","v":""}]
[{"$f":"IF(Food_Reference!A230=\"\",\"\",Food_Reference!A230)","v":""},{"$f":"IF(Food_Reference!B230=\"\",\"\",Food_Reference!B230)","v":""},{"$f":"IF(Food_Reference!C230=\"\",\"\",Food_Reference!C230)","v":""}]
[{"$f":"IF(Food_Reference!A231=\"\",\"\",Food_Reference!A231)","v":""},{"$f":"IF(Food_Reference!B231=\"\",\"\",Food_Reference!B231)","v":""},{"$f":"IF(Food_Reference!C231=\"\",\"\",Food_Reference!C231)","v":""}]
[{"$f":"IF(Food_Reference!A232=\"\",\"\",Food_Reference!A232)","v":""},{"$f":"IF(Food_Reference!B232=\"\",\"\",Food_Reference!B232)","v":""},{"$f":"IF(Food_Reference!C232=\"\",\"\",Food_Reference!C232)","v":""}]
[{"$f":"IF(Food_Reference!A233=\"\",\"\",Food_Reference!A233)","v":""},{"$f":"IF(Food_Reference!B233=\"\",\"\",Food_Reference!B233)","v":""},{"$f":"IF(Food_Reference!C233=\"\",\"\",Food_Reference!C233)","v":""}]
[{"$f":"IF(Food_Reference!A234=\"\",\"\",Food_Reference!A234)","v":""},{"$f":"IF(Food_Reference!B234=\"\",\"\",Food_Reference!B234)","v":""},{"$f":"IF(Food_Reference!C234=\"\",\"\",Food_Reference!C234)","v":""}]
[{"$f":"IF(Food_Reference!A235=\"\",\"\",Food_Reference!A235)","v":""},{"$f":"IF(Food_Reference!B235=\"\",\"\",Food_Reference!B235)","v":""},{"$f":"IF(Food_Reference!C235=\"\",\"\",Food_Reference!C235)","v":""}]
[{"$f":"IF(Food_Reference!A236=\"\",\"\",Food_Reference!A236)","v":""},{"$f":"IF(Food_Reference!B236=\"\",\"\",Food_Reference!B236)","v":""},{"$f":"IF(Food_Reference!C236=\"\",\"\",Food_Reference!C236)","v":""}]
[{"$f":"IF(Food_Reference!A237=\"\",\"\",Food_Reference!A237)","v":""},{"$f":"IF(Food_Reference!B237=\"\",\"\",Food_Reference!B237)","v":""},{"$f":"IF(Food_Reference!C237=\"\",\"\",Food_Reference!C237)","v":""}]
[{"$f":"IF(Food_Reference!A238=\"\",\"\",Food_Reference!A238)","v":""},{"$f":"IF(Food_Reference!B238=\"\",\"\",Food_Reference!B238)","v":""},{"$f":"IF(Food_Reference!C238=\"\",\"\",Food_Reference!C238)","v":""}]
[{"$f":"IF(Food_Reference!A239=\"\",\"\",Food_Reference!A239)","v":""},{"$f":"IF(Food_Reference!B239=\"\",\"\",Food_Reference!B239)","v":""},{"$f":"IF(Food_Reference!C239=\"\",\"\",Food_Reference!C239)","v":""}]
[{"$f":"IF(Food_Reference!A240=\"\",\"\",Food_Reference!A240)","v":""},{"$f":"IF(Food_Reference!B240=\"\",\"\",Food_Reference!B240)","v":""},{"$f":"IF(Food_Reference!C240=\"\",\"\",Food_Reference!C240)","v":""}]
[{"$f":"IF(Food_Reference!A241=\"\",\"\",Food_Reference!A241)","v":""},{"$f":"IF(Food_Reference!B241=\"\",\"\",Food_Reference!B241)","v":""},{"$f":"IF(Food_Reference!C241=\"\",\"\",Food_Reference!C241)","v":""}]
[{"$f":"IF(Food_Reference!A242=\"\",\"\",Food_Reference!A242)","v":""},{"$f":"IF(Food_Reference!B242=\"\",\"\",Food_Reference!B242)","v":""},{"$f":"IF(Food_Reference!C242=\"\",\"\",Food_Reference!C242)","v":""}]
[{"$f":"IF(Food_Reference!A243=\"\",\"\",Food_Reference!A243)","v":""},{"$f":"IF(Food_Reference!B243=\"\",\"\",Food_Reference!B243)","v":""},{"$f":"IF(Food_Reference!C243=\"\",\"\",Food_Reference!C243)","v":""}]
[{"$f":"IF(Food_Reference!A244=\"\",\"\",Food_Reference!A244)","v":""},{"$f":"IF(Food_Reference!B244=\"\",\"\",Food_Reference!B244)","v":""},{"$f":"IF(Food_Reference!C244=\"\",\"\",Food_Reference!C244)","v":""}]
[{"$f":"IF(Food_Reference!A245=\"\",\"\",Food_Reference!A245)","v":""},{"$f":"IF(Food_Reference!B245=\"\",\"\",Food_Reference!B245)","v":""},{"$f":"IF(Food_Reference!C245=\"\",\"\",Food_Reference!C245)","v":""}]
[{"$f":"IF(Food_Reference!A246=\"\",\"\",Food_Reference!A246)","v":""},{"$f":"IF(Food_Reference!B246=\"\",\"\",Food_Reference!B246)","v":""},{"$f":"IF(Food_Reference!C246=\"\",\"\",Food_Reference!C246)","v":""}]
[{"$f":"IF(Food_Reference!A247=\"\",\"\",Food_Reference!A247)","v":""},{"$f":"IF(Food_Reference!B247=\"\",\"\",Food_Reference!B247)","v":""},{"$f":"IF(Food_Reference!C247=\"\",\"\",Food_Reference!C247)","v":""}]
[{"$f":"IF(Food_Reference!A248=\"\",\"\",Food_Reference!A248)","v":""},{"$f":"IF(Food_Reference!B248=\"\",\"\",Food_Reference!B248)","v":""},{"$f":"IF(Food_Reference!C248=\"\",\"\",Food_Reference!C248)","v":""}]
[{"$f":"IF(Food_Reference!A249=\"\",\"\",Food_Reference!A249)","v":""},{"$f":"IF(Food_Reference!B249=\"\",\"\",Food_Reference!B249)","v":""},{"$f":"IF(Food_Reference!C249=\"\",\"\",Food_Reference!C249)","v":""}]
[{"$f":"IF(Food_Reference!A250=\"\",\"\",Food_Reference!A250)","v":""},{"$f":"IF(Food_Reference!B250=\"\",\"\",Food_Reference!B250)","v":""},{"$f":"IF(Food_Reference!C250=\"\",\"\",Food_Reference!C250)","v":""}]
[{"$f":"IF(Food_Reference!A251=\"\",\"\",Food_Reference!A251)","v":""},{"$f":"IF(Food_Reference!B251=\"\",\"\",Food_Reference!B251)","v":""},{"$f":"IF(Food_Reference!C251=\"\",\"\",Food_Reference!C251)","v":""}]
[{"$f":"IF(Food_Reference!A252=\"\",\"\",Food_Reference!A252)","v":""},{"$f":"IF(Food_Reference!B252=\"\",\"\",Food_Reference!B252)","v":""},{"$f":"IF(Food_Reference!C252=\"\",\"\",Food_Reference!C252)","v":""}]
[{"$f":"IF(Food_Reference!A253=\"\",\"\",Food_Reference!A253)","v":""},{"$f":"IF(Food_Reference!B253=\"\",\"\",Food_Reference!B253)","v":""},{"$f":"IF(Food_Reference!C253=\"\",\"\",Food_Reference!C253)","v":""}]
[{"$f":"IF(Food_Reference!A254=\"\",\"\",Food_Reference!A254)","v":""},{"$f":"IF(Food_Reference!B254=\"\",\"\",Food_Reference!B254)","v":""},{"$f":"IF(Food_Reference!C254=\"\",\"\",Food_Reference!C254)","v":""}]
[{"$f":"IF(Food_Reference!A255=\"\",\"\",Food_Reference!A255)","v":""},{"$f":"IF(Food_Reference!B255=\"\",\"\",Food_Reference!B255)","v":""},{"$f":"IF(Food_Reference!C255=\"\",\"\",Food_Reference!C255)","v":""}]
[{"$f":"IF(Food_Reference!A256=\"\",\"\",Food_Reference!A256)","v":""},{"$f":"IF(Food_Reference!B256=\"\",\"\",Food_Reference!B256)","v":""},{"$f":"IF(Food_Reference!C256=\"\",\"\",Food_Reference!C256)","v":""}]
[{"$f":"IF(Food_Reference!A257=\"\",\"\",Food_Reference!A257)","v":""},{"$f":"IF(Food_Reference!B257=\"\",\"\",Food_Reference!B257)","v":""},{"$f":"IF(Food_Reference!C257=\"\",\"\",Food_Reference!C257)","v":""}]
[{"$f":"IF(Food_Reference!A258=\"\",\"\",Food_Reference!A258)","v":""},{"$f":"IF(Food_Reference!B258=\"\",\"\",Food_Reference!B258)","v":""},{"$f":"IF(Food_Reference!C258=\"\",\"\",Food_Reference!C258)","v":""}]
[{"$f":"IF(Food_Reference!A259=\"\",\"\",Food_Reference!A259)","v":""},{"$f":"IF(Food_Reference!B259=\"\",\"\",Food_Reference!B259)","v":""},{"$f":"IF(Food_Reference!C259=\"\",\"\",Food_Reference!C259)","v":""}]
[{"$f":"IF(Food_Reference!A260=\"\",\"\",Food_Reference!A260)","v":""},{"$f":"IF(Food_Reference!B260=\"\",\"\",Food_Reference!B260)","v":""},{"$f":"IF(Food_Reference!C260=\"\",\"\",Food_Reference!C260)","v":""}]
[{"$f":"IF(Food_Reference!A261=\"\",\"\",Food_Reference!A261)","v":""},{"$f":"IF(Food_Reference!B261=\"\",\"\",Food_Reference!B261)","v":""},{"$f":"IF(Food_Reference!C261=\"\",\"\",Food_Reference!C261)","v":""}]
[{"$f":"IF(Food_Reference!A262=\"\",\"\",Food_Reference!A262)","v":""},{"$f":"IF(Food_Reference!B262=\"\",\"\",Food_Reference!B262)","v":""},{"$f":"IF(Food_Reference!C262=\"\",\"\",Food_Reference!C262)","v":""}]
[{"$f":"IF(Food_Reference!A263=\"\",\"\",Food_Reference!A263)","v":""},{"$f":"IF(Food_Reference!B263=\"\",\"\",Food_Reference!B263)","v":""},{"$f":"IF(Food_Reference!C263=\"\",\"\",Food_Reference!C263)","v":""}]
[{"$f":"IF(Food_Reference!A264=\"\",\"\",Food_Reference!A264)","v":""},{"$f":"IF(Food_Reference!B264=\"\",\"\",Food_Reference!B264)","v":""},{"$f":"IF(Food_Reference!C264=\"\",\"\",Food_Reference!C264)","v":""}]
[{"$f":"IF(Food_Reference!A265=\"\",\"\",Food_Reference!A265)","v":""},{"$f":"IF(Food_Reference!B265=\"\",\"\",Food_Reference!B265)","v":""},{"$f":"IF(Food_Reference!C265=\"\",\"\",Food_Reference!C265)","v":""}]
[{"$f":"IF(Food_Reference!A266=\"\",\"\",Food_Reference!A266)","v":""},{"$f":"IF(Food_Reference!B266=\"\",\"\",Food_Reference!B266)","v":""},{"$f":"IF(Food_Reference!C266=\"\",\"\",Food_Reference!C266)","v":""}]
[{"$f":"IF(Food_Reference!A267=\"\",\"\",Food_Reference!A267)","v":""},{"$f":"IF(Food_Reference!B267=\"\",\"\",Food_Reference!B267)","v":""},{"$f":"IF(Food_Reference!C267=\"\",\"\",Food_Reference!C267)","v":""}]
[{"$f":"IF(Food_Reference!A268=\"\",\"\",Food_Reference!A268)","v":""},{"$f":"IF(Food_Reference!B268=\"\",\"\",Food_Reference!B268)","v":""},{"$f":"IF(Food_Reference!C268=\"\",\"\",Food_Reference!C268)","v":""}]
[{"$f":"IF(Food_Reference!A269=\"\",\"\",Food_Reference!A269)","v":""},{"$f":"IF(Food_Reference!B269=\"\",\"\",Food_Reference!B269)","v":""},{"$f":"IF(Food_Reference!C269=\"\",\"\",Food_Reference!C269)","v":""}]
[{"$f":"IF(Food_Reference!A270=\"\",\"\",Food_Reference!A270)","v":""},{"$f":"IF(Food_Reference!B270=\"\",\"\",Food_Reference!B270)","v":""},{"$f":"IF(Food_Reference!C270=\"\",\"\",Food_Reference!C270)","v":""}]
[{"$f":"IF(Food_Reference!A271=\"\",\"\",Food_Reference!A271)","v":""},{"$f":"IF(Food_Reference!B271=\"\",\"\",Food_Reference!B271)","v":""},{"$f":"IF(Food_Reference!C271=\"\",\"\",Food_Reference!C271)","v":""}]
[{"$f":"IF(Food_Reference!A272=\"\",\"\",Food_Reference!A272)","v":""},{"$f":"IF(Food_Reference!B272=\"\",\"\",Food_Reference!B272)","v":""},{"$f":"IF(Food_Reference!C272=\"\",\"\",Food_Reference!C272)","v":""}]
[{"$f":"IF(Food_Reference!A273=\"\",\"\",Food_Reference!A273)","v":""},{"$f":"IF(Food_Reference!B273=\"\",\"\",Food_Reference!B273)","v":""},{"$f":"IF(Food_Reference!C273=\"\",\"\",Food_Reference!C273)","v":""}]
[{"$f":"IF(Food_Reference!A265=\"\",\"\",Food_Reference!A265)","v":""},{"$f":"IF(Food_Reference!B265=\"\",\"\",Food_Reference!B265)","v":""},{"$f":"IF(Food_Reference!C265=\"\",\"\",Food_Reference!C265)","v":""}]
[{"$f":"IF(Food_Reference!A266=\"\",\"\",Food_Reference!A266)","v":""},{"$f":"IF(Food_Reference!B266=\"\",\"\",Food_Reference!B266)","v":""},{"$f":"IF(Food_Reference!C266=\"\",\"\",Food_Reference!C266)","v":""}]
[{"$f":"IF(Food_Reference!A267=\"\",\"\",Food_Reference!A267)","v":""},{"$f":"IF(Food_Reference!B267=\"\",\"\",Food_Reference!B267)","v":""},{"$f":"IF(Food_Reference!C267=\"\",\"\",Food_Reference!C267)","v":""}]
[{"$f":"IF(Food_Reference!A268=\"\",\"\",Food_Reference!A268)","v":""},{"$f":"IF(Food_Reference!B268=\"\",\"\",Food_Reference!B268)","v":""},{"$f":"IF(Food_Reference!C268=\"\",\"\",Food_Reference!C268)","v":""}]
[{"$f":"IF(Food_Reference!A269=\"\",\"\",Food_Reference!A269)","v":""},{"$f":"IF(Food_Reference!B269=\"\",\"\",Food_Reference!B269)","v":""},{"$f":"IF(Food_Reference!C269=\"\",\"\",Food_Reference!C269)","v":""}]
[{"$f":"IF(Food_Reference!A270=\"\",\"\",Food_Reference!A270)","v":""},{"$f":"IF(Food_Reference!B270=\"\",\"\",Food_Reference!B270)","v":""},{"$f":"IF(Food_Reference!C270=\"\",\"\",Food_Reference!C270)","v":""}]
[{"$f":"IF(Food_Reference!A271=\"\",\"\",Food_Reference!A271)","v":""},{"$f":"IF(Food_Reference!B271=\"\",\"\",Food_Reference!B271)","v":""},{"$f":"IF(Food_Reference!C271=\"\",\"\",Food_Reference!C271)","v":""}]
[{"$f":"IF(Food_Reference!A272=\"\",\"\",Food_Reference!A272)","v":""},{"$f":"IF(Food_Reference!B272=\"\",\"\",Food_Reference!B272)","v":""},{"$f":"IF(Food_Reference!C272=\"\",\"\",Food_Reference!C272)","v":""}]
[{"$f":"IF(Food_Reference!A273=\"\",\"\",Food_Reference!A273)","v":""},{"$f":"IF(Food_Reference!B273=\"\",\"\",Food_Reference!B273)","v":""},{"$f":"IF(Food_Reference!C273=\"\",\"\",Food_Reference!C273)","v":""}]
[{"$f":"IF(Food_Reference!A274=\"\",\"\",Food_Reference!A274)","v":""},{"$f":"IF(Food_Reference!B274=\"\",\"\",Food_Reference!B274)","v":""},{"$f":"IF(Food_Reference!C274=\"\",\"\",Food_Reference!C274)","v":""}]
[{"$f":"IF(Food_Reference!A275=\"\",\"\",Food_Reference!A275)","v":""},{"$f":"IF(Food_Reference!B275=\"\",\"\",Food_Reference!B275)","v":""},{"$f":"IF(Food_Reference!C275=\"\",\"\",Food_Reference!C275)","v":""}]
[{"$f":"IF(Food_Reference!A276=\"\",\"\",Food_Reference!A276)","v":""},{"$f":"IF(Food_Reference!B276=\"\",\"\",Food_Reference!B276)","v":""},{"$f":"IF(Food_Reference!C276=\"\",\"\",Food_Reference!C276)","v":""}]
[{"$f":"IF(Food_Reference!A277=\"\",\"\",Food_Reference!A277)","v":""},{"$f":"IF(Food_Reference!B277=\"\",\"\",Food_Reference!B277)","v":""},{"$f":"IF(Food_Reference!C277=\"\",\"\",Food_Reference!C277)","v":""}]
[{"$f":"IF(Food_Reference!A278=\"\",\"\",Food_Reference!A278)","v":""},{"$f":"IF(Food_Reference!B278=\"\",\"\",Food_Reference!B278)","v":""},{"$f":"IF(Food_Reference!C278=\"\",\"\",Food_Reference!C278)","v":""}]
[{"$f":"IF(Food_Reference!A279=\"\",\"\",Food_Reference!A279)","v":""},{"$f":"IF(Food_Reference!B279=\"\",\"\",Food_Reference!B279)","v":""},{"$f":"IF(Food_Reference!C279=\"\",\"\",Food_Reference!C279)","v":""}]
[{"$f":"IF(Food_Reference!A280=\"\",\"\",Food_Reference!A280)","v":""},{"$f":"IF(Food_Reference!B280=\"\",\"\",Food_Reference!B280)","v":""},{"$f":"IF(Food_Reference!C280=\"\",\"\",Food_Reference!C280)","v":""}]
[{"$f":"IF(Food_Reference!A281=\"\",\"\",Food_Reference!A281)","v":""},{"$f":"IF(Food_Reference!B281=\"\",\"\",Food_Reference!B281)","v":""},{"$f":"IF(Food_Reference!C281=\"\",\"\",Food_Reference!C281)","v":""}]
[{"$f":"IF(Food_Reference!A282=\"\",\"\",Food_Reference!A282)","v":""},{"$f":"IF(Food_Reference!B282=\"\",\"\",Food_Reference!B282)","v":""},{"$f":"IF(Food_Reference!C282=\"\",\"\",Food_Reference!C282)","v":""}]
[{"$f":"IF(Food_Reference!A283=\"\",\"\",Food_Reference!A283)","v":""},{"$f":"IF(Food_Reference!B283=\"\",\"\",Food_Reference!B283)","v":""},{"$f":"IF(Food_Reference!C283=\"\",\"\",Food_Reference!C283)","v":""}]
[{"$f":"IF(Food_Reference!A284=\"\",\"\",Food_Reference!A284)","v":""},{"$f":"IF(Food_Reference!B284=\"\",\"\",Food_Reference!B284)","v":""},{"$f":"IF(Food_Reference!C284=\"\",\"\",Food_Reference!C284)","v":""}]
[{"$f":"IF(Food_Reference!A285=\"\",\"\",Food_Reference!A285)","v":""},{"$f":"IF(Food_Reference!B285=\"\",\"\",Food_Reference!B285)","v":""},{"$f":"IF(Food_Reference!C285=\"\",\"\",Food_Reference!C285)","v":""}]
[{"$f":"IF(Food_Reference!A286=\"\",\"\",Food_Reference!A286)","v":""},{"$f":"IF(Food_Reference!B286=\"\",\"\",Food_Reference!B286)","v":""},{"$f":"IF(Food_Reference!C286=\"\",\"\",Food_Reference!C286)","v":""}]
[{"$f":"IF(Food_Reference!A287=\"\",\"\",Food_Reference!A287)","v":""},{"$f":"IF(Food_Reference!B287=\"\",\"\",Food_Reference!B287)","v":""},{"$f":"IF(Food_Reference!C287=\"\",\"\",Food_Reference!C287)","v":""}]
[{"$f":"IF(Food_Reference!A288=\"\",\"\",Food_Reference!A288)","v":""},{"$f":"IF(Food_Reference!B288=\"\",\"\",Food_Reference!B288)","v":""},{"$f":"IF(Food_Reference!C288=\"\",\"\",Food_Reference!C288)","v":""}]
[{"$f":"IF(Food_Reference!A289=\"\",\"\",Food_Reference!A289)","v":""},{"$f":"IF(Food_Reference!B289=\"\",\"\",Food_Reference!B289)","v":""},{"$f":"IF(Food_Reference!C289=\"\",\"\",Food_Reference!C289)","v":""}]
[{"$f":"IF(Food_Reference!A290=\"\",\"\",Food_Reference!A290)","v":""},{"$f":"IF(Food_Reference!B290=\"\",\"\",Food_Reference!B290)","v":""},{"$f":"IF(Food_Reference!C290=\"\",\"\",Food_Reference!C290)","v":""}]
[{"$f":"IF(Food_Reference!A291=\"\",\"\",Food_Reference!A291)","v":""},{"$f":"IF(Food_Reference!B291=\"\",\"\",Food_Reference!B291)","v":""},{"$f":"IF(Food_Reference!C291=\"\",\"\",Food_Reference!C291)","v":""}]
[{"$f":"IF(Food_Reference!A292=\"\",\"\",Food_Reference!A292)","v":""},{"$f":"IF(Food_Reference!B292=\"\",\"\",Food_Reference!B292)","v":""},{"$f":"IF(Food_Reference!C292=\"\",\"\",Food_Reference!C292)","v":""}]
[{"$f":"IF(Food_Reference!A293=\"\",\"\",Food_Reference!A293)","v":""},{"$f":"IF(Food_Reference!B293=\"\",\"\",Food_Reference!B293)","v":""},{"$f":"IF(Food_Reference!C293=\"\",\"\",Food_Reference!C293)","v":""}]
[{"$f":"IF(Food_Reference!A294=\"\",\"\",Food_Reference!A294)","v":""},{"$f":"IF(Food_Reference!B294=\"\",\"\",Food_Reference!B294)","v":""},{"$f":"IF(Food_Reference!C294=\"\",\"\",Food_Reference!C294)","v":""}]
[{"$f":"IF(Food_Reference!A295=\"\",\"\",Food_Reference!A295)","v":""},{"$f":"IF(Food_Reference!B295=\"\",\"\",Food_Reference!B295)","v":""},{"$f":"IF(Food_Reference!C295=\"\",\"\",Food_Reference!C295)","v":""}]
[{"$f":"IF(Food_Reference!A296=\"\",\"\",Food_Reference!A296)","v":""},{"$f":"IF(Food_Reference!B296=\"\",\"\",Food_Reference!B296)","v":""},{"$f":"IF(Food_Reference!C296=\"\",\"\",Food_Reference!C296)","v":""}]
[{"$f":"IF(Food_Reference!A297=\"\",\"\",Food_Reference!A297)","v":""},{"$f":"IF(Food_Reference!B297=\"\",\"\",Food_Reference!B297)","v":""},{"$f":"IF(Food_Reference!C297=\"\",\"\",Food_Reference!C297)","v":""}]
[{"$f":"IF(Food_Reference!A286=\"\",\"\",Food_Reference!A286)","v":""},{"$f":"IF(Food_Reference!B286=\"\",\"\",Food_Reference!B286)","v":""},{"$f":"IF(Food_Reference!C286=\"\",\"\",Food_Reference!C286)","v":""}]
[{"$f":"IF(Food_Reference!A287=\"\",\"\",Food_Reference!A287)","v":""},{"$f":"IF(Food_Reference!B287=\"\",\"\",Food_Reference!B287)","v":""},{"$f":"IF(Food_Reference!C287=\"\",\"\",Food_Reference!C287)","v":""}]
[{"$f":"IF(Food_Reference!A288=\"\",\"\",Food_Reference!A288)","v":""},{"$f":"IF(Food_Reference!B288=\"\",\"\",Food_Reference!B288)","v":""},{"$f":"IF(Food_Reference!C288=\"\",\"\",Food_Reference!C288)","v":""}]
[{"$f":"IF(Food_Reference!A289=\"\",\"\",Food_Reference!A289)","v":""},{"$f":"IF(Food_Reference!B289=\"\",\"\",Food_Reference!B289)","v":""},{"$f":"IF(Food_Reference!C289=\"\",\"\",Food_Reference!C289)","v":""}]
[{"$f":"IF(Food_Reference!A290=\"\",\"\",Food_Reference!A290)","v":""},{"$f":"IF(Food_Reference!B290=\"\",\"\",Food_Reference!B290)","v":""},{"$f":"IF(Food_Reference!C290=\"\",\"\",Food_Reference!C290)","v":""}]
[{"$f":"IF(Food_Reference!A291=\"\",\"\",Food_Reference!A291)","v":""},{"$f":"IF(Food_Reference!B291=\"\",\"\",Food_Reference!B291)","v":""},{"$f":"IF(Food_Reference!C291=\"\",\"\",Food_Reference!C291)","v":""}]
[{"$f":"IF(Food_Reference!A292=\"\",\"\",Food_Reference!A292)","v":""},{"$f":"IF(Food_Reference!B292=\"\",\"\",Food_Reference!B292)","v":""},{"$f":"IF(Food_Reference!C292=\"\",\"\",Food_Reference!C292)","v":""}]
[{"$f":"IF(Food_Reference!A293=\"\",\"\",Food_Reference!A293)","v":""},{"$f":"IF(Food_Reference!B293=\"\",\"\",Food_Reference!B293)","v":""},{"$f":"IF(Food_Reference!C293=\"\",\"\",Food_Reference!C293)","v":""}]
[{"$f":"IF(Food_Reference!A294=\"\",\"\",Food_Reference!A294)","v":""},{"$f":"IF(Food_Reference!B294=\"\",\"\",Food_Reference!B294)","v":""},{"$f":"IF(Food_Reference!C294=\"\",\"\",Food_Reference!C294)","v":""}]
[{"$f":"IF(Food_Reference!A295=\"\",\"\",Food_Reference!A295)","v":""},{"$f":"IF(Food_Reference!B295=\"\",\"\",Food_Reference!B295)","v":""},{"$f":"IF(Food_Reference!C295=\"\",\"\",Food_Reference!C295)","v":""}]
[{"$f":"IF(Food_Reference!A296=\"\",\"\",Food_Reference!A296)","v":""},{"$f":"IF(Food_Reference!B296=\"\",\"\",Food_Reference!B296)","v":""},{"$f":"IF(Food_Reference!C296=\"\",\"\",Food_Reference!C296)","v":""}]
[{"$f":"IF(Food_Reference!A297=\"\",\"\",Food_Reference!A297)","v":""},{"$f":"IF(Food_Reference!B297=\"\",\"\",Food_Reference!B297)","v":""},{"$f":"IF(Food_Reference!C297=\"\",\"\",Food_Reference!C297)","v":""}]
[{"$f":"IF(Food_Reference!A298=\"\",\"\",Food_Reference!A298)","v":""},{"$f":"IF(Food_Reference!B298=\"\",\"\",Food_Reference!B298)","v":""},{"$f":"IF(Food_Reference!C298=\"\",\"\",Food_Reference!C298)","v":""}]
[{"$f":"IF(Food_Reference!A299=\"\",\"\",Food_Reference!A299)","v":""},{"$f":"IF(Food_Reference!B299=\"\",\"\",Food_Reference!B299)","v":""},{"$f":"IF(Food_Reference!C299=\"\",\"\",Food_Reference!C299)","v":""}]
[{"$f":"IF(Food_Reference!A300=\"\",\"\",Food_Reference!A300)","v":""},{"$f":"IF(Food_Reference!B300=\"\",\"\",Food_Reference!B300)","v":""},{"$f":"IF(Food_Reference!C300=\"\",\"\",Food_Reference!C300)","v":""}]
[{"$f":"IF(Food_Reference!A301=\"\",\"\",Food_Reference!A301)","v":""},{"$f":"IF(Food_Reference!B301=\"\",\"\",Food_Reference!B301)","v":""},{"$f":"IF(Food_Reference!C301=\"\",\"\",Food_Reference!C301)","v":""}]
[{"$f":"IF(Food_Reference!A302=\"\",\"\",Food_Reference!A302)","v":""},{"$f":"IF(Food_Reference!B302=\"\",\"\",Food_Reference!B302)","v":""},{"$f":"IF(Food_Reference!C302=\"\",\"\",Food_Reference!C302)","v":""}]
[{"$f":"IF(Food_Reference!A303=\"\",\"\",Food_Reference!A303)","v":""},{"$f":"IF(Food_Reference!B303=\"\",\"\",Food_Reference!B303)","v":""},{"$f":"IF(Food_Reference!C303=\"\",\"\",Food_Reference!C303)","v":""}]
[{"$f":"IF(Food_Reference!A304=\"\",\"\",Food_Reference!A304)","v":""},{"$f":"IF(Food_Reference!B304=\"\",\"\",Food_Reference!B304)","v":""},{"$f":"IF(Food_Reference!C304=\"\",\"\",Food_Reference!C304)","v":""}]
[{"$f":"IF(Food_Reference!A305=\"\",\"\",Food_Reference!A305)","v":""},{"$f":"IF(Food_Reference!B305=\"\",\"\",Food_Reference!B305)","v":""},{"$f":"IF(Food_Reference!C305=\"\",\"\",Food_Reference!C305)","v":""}]
[{"$f":"IF(Food_Reference!A306=\"\",\"\",Food_Reference!A306)","v":""},{"$f":"IF(Food_Reference!B306=\"\",\"\",Food_Reference!B306)","v":""},{"$f":"IF(Food_Reference!C306=\"\",\"\",Food_Reference!C306)","v":""}]
[{"$f":"IF(Food_Reference!A307=\"\",\"\",Food_Reference!A307)","v":""},{"$f":"IF(Food_Reference!B307=\"\",\"\",Food_Reference!B307)","v":""},{"$f":"IF(Food_Reference!C307=\"\",\"\",Food_Reference!C307)","v":""}]
[{"$f":"IF(Food_Reference!A308=\"\",\"\",Food_Reference!A308)","v":""},{"$f":"IF(Food_Reference!B308=\"\",\"\",Food_Reference!B308)","v":""},{"$f":"IF(Food_Reference!C308=\"\",\"\",Food_Reference!C308)","v":""}]
[{"$f":"IF(Food_Reference!A309=\"\",\"\",Food_Reference!A309)","v":""},{"$f":"IF(Food_Reference!B309=\"\",\"\",Food_Reference!B309)","v":""},{"$f":"IF(Food_Reference!C309=\"\",\"\",Food_Reference!C309)","v":""}]
[{"$f":"IF(Food_Reference!A310=\"\",\"\",Food_Reference!A310)","v":""},{"$f":"IF(Food_Reference!B310=\"\",\"\",Food_Reference!B310)","v":""},{"$f":"IF(Food_Reference!C310=\"\",\"\",Food_Reference!C310)","v":""}]
[{"$f":"IF(Food_Reference!A311=\"\",\"\",Food_Reference!A311)","v":""},{"$f":"IF(Food_Reference!B311=\"\",\"\",Food_Reference!B311)","v":""},{"$f":"IF(Food_Reference!C311=\"\",\"\",Food_Reference!C311)","v":""}]
[{"$f":"IF(Food_Reference!A312=\"\",\"\",Food_Reference!A312)","v":""},{"$f":"IF(Food_Reference!B312=\"\",\"\",Food_Reference!B312)","v":""},{"$f":"IF(Food_Reference!C312=\"\",\"\",Food_Reference!C312)","v":""}]
[{"$f":"IF(Food_Reference!A313=\"\",\"\",Food_Reference!A313)","v":""},{"$f":"IF(Food_Reference!B313=\"\",\"\",Food_Reference!B313)","v":""},{"$f":"IF(Food_Reference!C313=\"\",\"\",Food_Reference!C313)","v":""}]
[{"$f":"IF(Food_Reference!A314=\"\",\"\",Food_Reference!A314)","v":""},{"$f":"IF(Food_Reference!B314=\"\",\"\",Food_Reference!B314)","v":""},{"$f":"IF(Food_Reference!C314=\"\",\"\",Food_Reference!C314)","v":""}]
[{"$f":"IF(Food_Reference!A315=\"\",\"\",Food_Reference!A315)","v":""},{"$f":"IF(Food_Reference!B315=\"\",\"\",Food_Reference!B315)","v":""},{"$f":"IF(Food_Reference!C315=\"\",\"\",Food_Reference!C315)","v":""}]
[{"$f":"IF(Food_Reference!A316=\"\",\"\",Food_Reference!A316)","v":""},{"$f":"IF(Food_Reference!B316=\"\",\"\",Food_Reference!B316)","v":""},{"$f":"IF(Food_Reference!C316=\"\",\"\",Food_Reference!C316)","v":""}]
[{"$f":"IF(Food_Reference!A317=\"\",\"\",Food_Reference!A317)","v":""},{"$f":"IF(Food_Reference!B317=\"\",\"\",Food_Reference!B317)","v":""},{"$f":"IF(Food_Reference!C317=\"\",\"\",Food_Reference!C317)","v":""}]
[{"$f":"IF(Food_Reference!A318=\"\",\"\",Food_Reference!A318)","v":""},{"$f":"IF(Food_Reference!B318=\"\",\"\",Food_Reference!B318)","v":""},{"$f":"IF(Food_Reference!C318=\"\",\"\",Food_Reference!C318)","v":""}]
[{"$f":"IF(Food_Reference!A319=\"\",\"\",Food_Reference!A319)","v":""},{"$f":"IF(Food_Reference!B319=\"\",\"\",Food_Reference!B319)","v":""},{"$f":"IF(Food_Reference!C319=\"\",\"\",Food_Reference!C319)","v":""}]
[{"$f":"IF(Food_Reference!A320=\"\",\"\",Food_Reference!A320)","v":""},{"$f":"IF(Food_Reference!B320=\"\",\"\",Food_Reference!B320)","v":""},{"$f":"IF(Food_Reference!C320=\"\",\"\",Food_Reference!C320)","v":""}]
[{"$f":"IF(Food_Reference!A321=\"\",\"\",Food_Reference!A321)","v":""},{"$f":"IF(Food_Reference!B321=\"\",\"\",Food_Reference!B321)","v":""},{"$f":"IF(Food_Reference!C321=\"\",\"\",Food_Reference!C321)","v":""}]
[{"$f":"IF(Food_Reference!A322=\"\",\"\",Food_Reference!A322)","v":""},{"$f":"IF(Food_Reference!B322=\"\",\"\",Food_Reference!B322)","v":""},{"$f":"IF(Food_Reference!C322=\"\",\"\",Food_Reference!C322)","v":""}]
[{"$f":"IF(Food_Reference!A323=\"\",\"\",Food_Reference!A323)","v":""},{"$f":"IF(Food_Reference!B323=\"\",\"\",Food_Reference!B323)","v":""},{"$f":"IF(Food_Reference!C323=\"\",\"\",Food_Reference!C323)","v":""}]
[{"$f":"IF(Food_Reference!A324=\"\",\"\",Food_Reference!A324)","v":""},{"$f":"IF(Food_Reference!B324=\"\",\"\",Food_Reference!B324)","v":""},{"$f":"IF(Food_Reference!C324=\"\",\"\",Food_Reference!C324)","v":""}]
[{"$f":"IF(Food_Reference!A325=\"\",\"\",Food_Reference!A325)","v":""},{"$f":"IF(Food_Reference!B325=\"\",\"\",Food_Reference!B325)","v":""},{"$f":"IF(Food_Reference!C325=\"\",\"\",Food_Reference!C325)","v":""}]
[{"$f":"IF(Food_Reference!A326=\"\",\"\",Food_Reference!A326)","v":""},{"$f":"IF(Food_Reference!B326=\"\",\"\",Food_Reference!B326)","v":""},{"$f":"IF(Food_Reference!C326=\"\",\"\",Food_Reference!C326)","v":""}]
[{"$f":"IF(Food_Reference!A327=\"\",\"\",Food_Reference!A327)","v":""},{"$f":"IF(Food_Reference!B327=\"\",\"\",Food_Reference!B327)","v":""},{"$f":"IF(Food_Reference!C327=\"\",\"\",Food_Reference!C327)","v":""}]
[{"$f":"IF(Food_Reference!A328=\"\",\"\",Food_Reference!A328)","v":""},{"$f":"IF(Food_Reference!B328=\"\",\"\",Food_Reference!B328)","v":""},{"$f":"IF(Food_Reference!C328=\"\",\"\",Food_Reference!C328)","v":""}]
[{"$f":"IF(Food_Reference!A329=\"\",\"\",Food_Reference!A329)","v":""},{"$f":"IF(Food_Reference!B329=\"\",\"\",Food_Reference!B329)","v":""},{"$f":"IF(Food_Reference!C329=\"\",\"\",Food_Reference!C329)","v":""}]
[{"$f":"IF(Food_Reference!A330=\"\",\"\",Food_Reference!A330)","v":""},{"$f":"IF(Food_Reference!B330=\"\",\"\",Food_Reference!B330)","v":""},{"$f":"IF(Food_Reference!C330=\"\",\"\",Food_Reference!C330)","v":""}]
[{"$f":"IF(Food_Reference!A331=\"\",\"\",Food_Reference!A331)","v":""},{"$f":"IF(Food_Reference!B331=\"\",\"\",Food_Reference!B331)","v":""},{"$f":"IF(Food_Reference!C331=\"\",\"\",Food_Reference!C331)","v":""}]
[{"$f":"IF(Food_Reference!A332=\"\",\"\",Food_Reference!A332)","v":""},{"$f":"IF(Food_Reference!B332=\"\",\"\",Food_Reference!B332)","v":""},{"$f":"IF(Food_Reference!C332=\"\",\"\",Food_Reference!C332)","v":""}]
[{"$f":"IF(Food_Reference!A333=\"\",\"\",Food_Reference!A333)","v":""},{"$f":"IF(Food_Reference!B333=\"\",\"\",Food_Reference!B333)","v":""},{"$f":"IF(Food_Reference!C333=\"\",\"\",Food_Reference!C333)","v":""}]
[{"$f":"IF(Food_Reference!A334=\"\",\"\",Food_Reference!A334)","v":""},{"$f":"IF(Food_Reference!B334=\"\",\"\",Food_Reference!B334)","v":""},{"$f":"IF(Food_Reference!C334=\"\",\"\",Food_Reference!C334)","v":""}]
[{"$f":"IF(Food_Reference!A335=\"\",\"\",Food_Reference!A335)","v":""},{"$f":"IF(Food_Reference!B335=\"\",\"\",Food_Reference!B335)","v":""},{"$f":"IF(Food_Reference!C335=\"\",\"\",Food_Reference!C335)","v":""}]
[{"$f":"IF(Food_Reference!A336=\"\",\"\",Food_Reference!A336)","v":""},{"$f":"IF(Food_Reference!B336=\"\",\"\",Food_Reference!B336)","v":""},{"$f":"IF(Food_Reference!C336=\"\",\"\",Food_Reference!C336)","v":""}]
[{"$f":"IF(Food_Reference!A337=\"\",\"\",Food_Reference!A337)","v":""},{"$f":"IF(Food_Reference!B337=\"\",\"\",Food_Reference!B337)","v":""},{"$f":"IF(Food_Reference!C337=\"\",\"\",Food_Reference!C337)","v":""}]
[{"$f":"IF(Food_Reference!A338=\"\",\"\",Food_Reference!A338)","v":""},{"$f":"IF(Food_Reference!B338=\"\",\"\",Food_Reference!B338)","v":""},{"$f":"IF(Food_Reference!C338=\"\",\"\",Food_Reference!C338)","v":""}]
[{"$f":"IF(Food_Reference!A339=\"\",\"\",Food_Reference!A339)","v":""},{"$f":"IF(Food_Reference!B339=\"\",\"\",Food_Reference!B339)","v":""},{"$f":"IF(Food_Reference!C339=\"\",\"\",Food_Reference!C339)","v":""}]
[{"$f":"IF(Food_Reference!A340=\"\",\"\",Food_Reference!A340)","v":""},{"$f":"IF(Food_Reference!B340=\"\",\"\",Food_Reference!B340)","v":""},{"$f":"IF(Food_Reference!C340=\"\",\"\",Food_Reference!C340)","v":""}]
[{"$f":"IF(Food_Reference!A341=\"\",\"\",Food_Reference!A341)","v":""},{"$f":"IF(Food_Reference!B341=\"\",\"\",Food_Reference!B341)","v":""},{"$f":"IF(Food_Reference!C341=\"\",\"\",Food_Reference!C341)","v":""}]
[{"$f":"IF(Food_Reference!A342=\"\",\"\",Food_Reference!A342)","v":""},{"$f":"IF(Food_Reference!B342=\"\",\"\",Food_Reference!B342)","v":""},{"$f":"IF(Food_Reference!C342=\"\",\"\",Food_Reference!C342)","v":""}]
[{"$f":"IF(Food_Reference!A343=\"\",\"\",Food_Reference!A343)","v":""},{"$f":"IF(Food_Reference!B343=\"\",\"\",Food_Reference!B343)","v":""},{"$f":"IF(Food_Reference!C343=\"\",\"\",Food_Reference!C343)","v":""}]
[{"$f":"IF(Food_Reference!A344=\"\",\"\",Food_Reference!A344)","v":""},{"$f":"IF(Food_Reference!B344=\"\",\"\",Food_Reference!B344)","v":""},{"$f":"IF(Food_Reference!C344=\"\",\"\",Food_Reference!C344)","v":""}]
[{"$f":"IF(Food_Reference!A345=\"\",\"\",Food_Reference!A345)","v":""},{"$f":"IF(Food_Reference!B345=\"\",\"\",Food_Reference!B345)","v":""},{"$f":"IF(Food_Reference!C345=\"\",\"\",Food_Reference!C345)","v":""}]
[{"$f":"IF(Food_Reference!A346=\"\",\"\",Food_Reference!A346)","v":""},{"$f":"IF(Food_Reference!B346=\"\",\"\",Food_Reference!B346)","v":""},{"$f":"IF(Food_Reference!C346=\"\",\"\",Food_Reference!C346)","v":""}]
[{"$f":"IF(Food_Reference!A347=\"\",\"\",Food_Reference!A347)","v":""},{"$f":"IF(Food_Reference!B347=\"\",\"\",Food_Reference!B347)","v":""},{"$f":"IF(Food_Reference!C347=\"\",\"\",Food_Reference!C347)","v":""}]
[{"$f":"IF(Food_Reference!A348=\"\",\"\",Food_Reference!A348)","v":""},{"$f":"IF(Food_Reference!B348=\"\",\"\",Food_Reference!B348)","v":""},{"$f":"IF(Food_Reference!C348=\"\",\"\",Food_Reference!C348)","v":""}]
[{"$f":"IF(Food_Reference!A349=\"\",\"\",Food_Reference!A349)","v":""},{"$f":"IF(Food_Reference!B349=\"\",\"\",Food_Reference!B349)","v":""},{"$f":"IF(Food_Reference!C349=\"\",\"\",Food_Reference!C349)","v":""}]
[{"$f":"IF(Food_Reference!A350=\"\",\"\",Food_Reference!A350)","v":""},{"$f":"IF(Food_Reference!B350=\"\",\"\",Food_Reference!B350)","v":""},{"$f":"IF(Food_Reference!C350=\"\",\"\",Food_Reference!C350)","v":""}]
[{"$f":"IF(Food_Reference!A351=\"\",\"\",Food_Reference!A351)","v":""},{"$f":"IF(Food_Reference!B351=\"\",\"\",Food_Reference!B351)","v":""},{"$f":"IF(Food_Reference!C351=\"\",\"\",Food_Reference!C351)","v":""}]
[{"$f":"IF(Food_Reference!A352=\"\",\"\",Food_Reference!A352)","v":""},{"$f":"IF(Food_Reference!B352=\"\",\"\",Food_Reference!B352)","v":""},{"$f":"IF(Food_Reference!C352=\"\",\"\",Food_Reference!C352)","v":""}]
[{"$f":"IF(Food_Reference!A353=\"\",\"\",Food_Reference!A353)","v":""},{"$f":"IF(Food_Reference!B353=\"\",\"\",Food_Reference!B353)","v":""},{"$f":"IF(Food_Reference!C353=\"\",\"\",Food_Reference!C353)","v":""}]
[{"$f":"IF(Food_Reference!A354=\"\",\"\",Food_Reference!A354)","v":""},{"$f":"IF(Food_Reference!B354=\"\",\"\",Food_Reference!B354)","v":""},{"$f":"IF(Food_Reference!C354=\"\",\"\",Food_Reference!C354)","v":""}]
[{"$f":"IF(Food_Reference!A355=\"\",\"\",Food_Reference!A355)","v":""},{"$f":"IF(Food_Reference!B355=\"\",\"\",Food_Reference!B355)","v":""},{"$f":"IF(Food_Reference!C355=\"\",\"\",Food_Reference!C355)","v":""}]
[{"$f":"IF(Food_Reference!A356=\"\",\"\",Food_Reference!A356)","v":""},{"$f":"IF(Food_Reference!B356=\"\",\"\",Food_Reference!B356)","v":""},{"$f":"IF(Food_Reference!C356=\"\",\"\",Food_Reference!C356)","v":""}]
[{"$f":"IF(Food_Reference!A357=\"\",\"\",Food_Reference!A357)","v":""},{"$f":"IF(Food_Reference!B357=\"\",\"\",Food_Reference!B357)","v":""},{"$f":"IF(Food_Reference!C357=\"\",\"\",Food_Reference!C357)","v":""}]
[{"$f":"IF(Food_Reference!A358=\"\",\"\",Food_Reference!A358)","v":""},{"$f":"IF(Food_Reference!B358=\"\",\"\",Food_Reference!B358)","v":""},{"$f":"IF(Food_Reference!C358=\"\",\"\",Food_Reference!C358)","v":""}]
[{"$f":"IF(Food_Reference!A359=\"\",\"\",Food_Reference!A359)","v":""},{"$f":"IF(Food_Reference!B359=\"\",\"\",Food_Reference!B359)","v":""},{"$f":"IF(Food_Reference!C359=\"\",\"\",Food_Reference!C359)","v":""}]
[{"$f":"IF(Food_Reference!A360=\"\",\"\",Food_Reference!A360)","v":""},{"$f":"IF(Food_Reference!B360=\"\",\"\",Food_Reference!B360)","v":""},{"$f":"IF(Food_Reference!C360=\"\",\"\",Food_Reference!C360)","v":""}]
[{"$f":"IF(Food_Reference!A361=\"\",\"\",Food_Reference!A361)","v":""},{"$f":"IF(Food_Reference!B361=\"\",\"\",Food_Reference!B361)","v":""},{"$f":"IF(Food_Reference!C361=\"\",\"\",Food_Reference!C361)","v":""}]
[{"$f":"IF(Food_Reference!A362=\"\",\"\",Food_Reference!A362)","v":""},{"$f":"IF(Food_Reference!B362=\"\",\"\",Food_Reference!B362)","v":""},{"$f":"IF(Food_Reference!C362=\"\",\"\",Food_Reference!C362)","v":""}]
[{"$f":"IF(Food_Reference!A363=\"\",\"\",Food_Reference!A363)","v":""},{"$f":"IF(Food_Reference!B363=\"\",\"\",Food_Reference!B363)","v":""},{"$f":"IF(Food_Reference!C363=\"\",\"\",Food_Reference!C363)","v":""}]
[{"$f":"IF(Food_Reference!A364=\"\",\"\",Food_Reference!A364)","v":""},{"$f":"IF(Food_Reference!B364=\"\",\"\",Food_Reference!B364)","v":""},{"$f":"IF(Food_Reference!C364=\"\",\"\",Food_Reference!C364)","v":""}]
[{"$f":"IF(Food_Reference!A365=\"\",\"\",Food_Reference!A365)","v":""},{"$f":"IF(Food_Reference!B365=\"\",\"\",Food_Reference!B365)","v":""},{"$f":"IF(Food_Reference!C365=\"\",\"\",Food_Reference!C365)","v":""}]
[{"$f":"IF(Food_Reference!A366=\"\",\"\",Food_Reference!A366)","v":""},{"$f":"IF(Food_Reference!B366=\"\",\"\",Food_Reference!B366)","v":""},{"$f":"IF(Food_Reference!C366=\"\",\"\",Food_Reference!C366)","v":""}]
[{"$f":"IF(Food_Reference!A367=\"\",\"\",Food_Reference!A367)","v":""},{"$f":"IF(Food_Reference!B367=\"\",\"\",Food_Reference!B367)","v":""},{"$f":"IF(Food_Reference!C367=\"\",\"\",Food_Reference!C367)","v":""}]
[{"$f":"IF(Food_Reference!A368=\"\",\"\",Food_Reference!A368)","v":""},{"$f":"IF(Food_Reference!B368=\"\",\"\",Food_Reference!B368)","v":""},{"$f":"IF(Food_Reference!C368=\"\",\"\",Food_Reference!C368)","v":""}]
[{"$f":"IF(Food_Reference!A369=\"\",\"\",Food_Reference!A369)","v":""},{"$f":"IF(Food_Reference!B369=\"\",\"\",Food_Reference!B369)","v":""},{"$f":"IF(Food_Reference!C369=\"\",\"\",Food_Reference!C369)","v":""}]
[{"$f":"IF(Food_Reference!A370=\"\",\"\",Food_Reference!A370)","v":""},{"$f":"IF(Food_Reference!B370=\"\",\"\",Food_Reference!B370)","v":""},{"$f":"IF(Food_Reference!C370=\"\",\"\",Food_Reference!C370)","v":""}]
[{"$f":"IF(Food_Reference!A371=\"\",\"\",Food_Reference!A371)","v":""},{"$f":"IF(Food_Reference!B371=\"\",\"\",Food_Reference!B371)","v":""},{"$f":"IF(Food_Reference!C371=\"\",\"\",Food_Reference!C371)","v":""}]
[{"$f":"IF(Food_Reference!A372=\"\",\"\",Food_Reference!A372)","v":""},{"$f":"IF(Food_Reference!B372=\"\",\"\",Food_Reference!B372)","v":""},{"$f":"IF(Food_Reference!C372=\"\",\"\",Food_Reference!C372)","v":""}]
[{"$f":"IF(Food_Reference!A373=\"\",\"\",Food_Reference!A373)","v":""},{"$f":"IF(Food_Reference!B373=\"\",\"\",Food_Reference!B373)","v":""},{"$f":"IF(Food_Reference!C373=\"\",\"\",Food_Reference!C373)","v":""}]
[{"$f":"IF(Food_Reference!A374=\"\",\"\",Food_Reference!A374)","v":""},{"$f":"IF(Food_Reference!B374=\"\",\"\",Food_Reference!B374)","v":""},{"$f":"IF(Food_Reference!C374=\"\",\"\",Food_Reference!C374)","v":""}]
[{"$f":"IF(Food_Reference!A375=\"\",\"\",Food_Reference!A375)","v":""},{"$f":"IF(Food_Reference!B375=\"\",\"\",Food_Reference!B375)","v":""},{"$f":"IF(Food_Reference!C375=\"\",\"\",Food_Reference!C375)","v":""}]
[{"$f":"IF(Food_Reference!A376=\"\",\"\",Food_Reference!A376)","v":""},{"$f":"IF(Food_Reference!B376=\"\",\"\",Food_Reference!B376)","v":""},{"$f":"IF(Food_Reference!C376=\"\",\"\",Food_Reference!C376)","v":""}]
[{"$f":"IF(Food_Reference!A377=\"\",\"\",Food_Reference!A377)","v":""},{"$f":"IF(Food_Reference!B377=\"\",\"\",Food_Reference!B377)","v":""},{"$f":"IF(Food_Reference!C377=\"\",\"\",Food_Reference!C377)","v":""}]
[{"$f":"IF(Food_Reference!A378=\"\",\"\",Food_Reference!A378)","v":""},{"$f":"IF(Food_Reference!B378=\"\",\"\",Food_Reference!B378)","v":""},{"$f":"IF(Food_Reference!C378=\"\",\"\",Food_Reference!C378)","v":""}]
[{"$f":"IF(Food_Reference!A379=\"\",\"\",Food_Reference!A379)","v":""},{"$f":"IF(Food_Reference!B379=\"\",\"\",Food_Reference!B379)","v":""},{"$f":"IF(Food_Reference!C379=\"\",\"\",Food_Reference!C379)","v":""}]
[{"$f":"IF(Food_Reference!A380=\"\",\"\",Food_Reference!A380)","v":""},{"$f":"IF(Food_Reference!B380=\"\",\"\",Food_Reference!B380)","v":""},{"$f":"IF(Food_Reference!C380=\"\",\"\",Food_Reference!C380)","v":""}]
[{"$f":"IF(Food_Reference!A381=\"\",\"\",Food_Reference!A381)","v":""},{"$f":"IF(Food_Reference!B381=\"\",\"\",Food_Reference!B381)","v":""},{"$f":"IF(Food_Reference!C381=\"\",\"\",Food_Reference!C381)","v":""}]
[{"$f":"IF(Food_Reference!A382=\"\",\"\",Food_Reference!A382)","v":""},{"$f":"IF(Food_Reference!B382=\"\",\"\",Food_Reference!B382)","v":""},{"$f":"IF(Food_Reference!C382=\"\",\"\",Food_Reference!C382)","v":""}]
[{"$f":"IF(Food_Reference!A383=\"\",\"\",Food_Reference!A383)","v":""},{"$f":"IF(Food_Reference!B383=\"\",\"\",Food_Reference!B383)","v":""},{"$f":"IF(Food_Reference!C383=\"\",\"\",Food_Reference!C383)","v":""}]
[{"$f":"IF(Food_Reference!A384=\"\",\"\",Food_Reference!A384)","v":""},{"$f":"IF(Food_Reference!B384=\"\",\"\",Food_Reference!B384)","v":""},{"$f":"IF(Food_Reference!C384=\"\",\"\",Food_Reference!C384)","v":""}]
[{"$f":"IF(Food_Reference!A385=\"\",\"\",Food_Reference!A385)","v":""},{"$f":"IF(Food_Reference!B385=\"\",\"\",Food_Reference!B385)","v":""},{"$f":"IF(Food_Reference!C385=\"\",\"\",Food_Reference!C385)","v":""}]
[{"$f":"IF(Food_Reference!A386=\"\",\"\",Food_Reference!A386)","v":""},{"$f":"IF(Food_Reference!B386=\"\",\"\",Food_Reference!B386)","v":""},{"$f":"IF(Food_Reference!C386=\"\",\"\",Food_Reference!C386)","v":""}]
[{"$f":"IF(Food_Reference!A387=\"\",\"\",Food_Reference!A387)","v":""},{"$f":"IF(Food_Reference!B387=\"\",\"\",Food_Reference!B387)","v":""},{"$f":"IF(Food_Reference!C387=\"\",\"\",Food_Reference!C387)","v":""}]
[{"$f":"IF(Food_Reference!A388=\"\",\"\",Food_Reference!A388)","v":""},{"$f":"IF(Food_Reference!B388=\"\",\"\",Food_Reference!B388)","v":""},{"$f":"IF(Food_Reference!C388=\"\",\"\",Food_Reference!C388)","v":""}]
[{"$f":"IF(Food_Reference!A389=\"\",\"\",Food_Reference!A389)","v":""},{"$f":"IF(Food_Reference!B389=\"\",\"\",Food_Reference!B389)","v":""},{"$f":"IF(Food_Reference!C389=\"\",\"\",Food_Reference!C389)","v":""}]
[{"$f":"IF(Food_Reference!A390=\"\",\"\",Food_Reference!A390)","v":""},{"$f":"IF(Food_Reference!B390=\"\",\"\",Food_Reference!B390)","v":""},{"$f":"IF(Food_Reference!C390=\"\",\"\",Food_Reference!C390)","v":""}]
[{"$f":"IF(Food_Reference!A391=\"\",\"\",Food_Reference!A391)","v":""},{"$f":"IF(Food_Reference!B391=\"\",\"\",Food_Reference!B391)","v":""},{"$f":"IF(Food_Reference!C391=\"\",\"\",Food_Reference!C391)","v":""}]
[{"$f":"IF(Food_Reference!A392=\"\",\"\",Food_Reference!A392)","v":""},{"$f":"IF(Food_Reference!B392=\"\",\"\",Food_Reference!B392)","v":""},{"$f":"IF(Food_Reference!C392=\"\",\"\",Food_Reference!C392)","v":""}]
[{"$f":"IF(Food_Reference!A393=\"\",\"\",Food_Reference!A393)","v":""},{"$f":"IF(Food_Reference!B393=\"\",\"\",Food_Reference!B393)","v":""},{"$f":"IF(Food_Reference!C393=\"\",\"\",Food_Reference!C393)","v":""}]
[{"$f":"IF(Food_Reference!A394=\"\",\"\",Food_Reference!A394)","v":""},{"$f":"IF(Food_Reference!B394=\"\",\"\",Food_Reference!B394)","v":""},{"$f":"IF(Food_Reference!C394=\"\",\"\",Food_Reference!C394)","v":""}]
[{"$f":"IF(Food_Reference!A395=\"\",\"\",Food_Reference!A395)","v":""},{"$f":"IF(Food_Reference!B395=\"\",\"\",Food_Reference!B395)","v":""},{"$f":"IF(Food_Reference!C395=\"\",\"\",Food_Reference!C395)","v":""}]
[{"$f":"IF(Food_Reference!A396=\"\",\"\",Food_Reference!A396)","v":""},{"$f":"IF(Food_Reference!B396=\"\",\"\",Food_Reference!B396)","v":""},{"$f":"IF(Food_Reference!C396=\"\",\"\",Food_Reference!C396)","v":""}]
[{"$f":"IF(Food_Reference!A397=\"\",\"\",Food_Reference!A397)","v":""},{"$f":"IF(Food_Reference!B397=\"\",\"\",Food_Reference!B397)","v":""},{"$f":"IF(Food_Reference!C397=\"\",\"\",Food_Reference!C397)","v":""}]
[{"$f":"IF(Food_Reference!A398=\"\",\"\",Food_Reference!A398)","v":""},{"$f":"IF(Food_Reference!B398=\"\",\"\",Food_Reference!B398)","v":""},{"$f":"IF(Food_Reference!C398=\"\",\"\",Food_Reference!C398)","v":""}]
[{"$f":"IF(Food_Reference!A399=\"\",\"\",Food_Reference!A399)","v":""},{"$f":"IF(Food_Reference!B399=\"\",\"\",Food_Reference!B399)","v":""},{"$f":"IF(Food_Reference!C399=\"\",\"\",Food_Reference!C399)","v":""}]
[{"$f":"IF(Food_Reference!A400=\"\",\"\",Food_Reference!A400)","v":""},{"$f":"IF(Food_Reference!B400=\"\",\"\",Food_Reference!B400)","v":""},{"$f":"IF(Food_Reference!C400=\"\",\"\",Food_Reference!C400)","v":""}]
[{"$f":"IF(Food_Reference!A401=\"\",\"\",Food_Reference!A401)","v":""},{"$f":"IF(Food_Reference!B401=\"\",\"\",Food_Reference!B401)","v":""},{"$f":"IF(Food_Reference!C401=\"\",\"\",Food_Reference!C401)","v":""}]
[{"$f":"IF(Food_Reference!A402=\"\",\"\",Food_Reference!A402)","v":""},{"$f":"IF(Food_Reference!B402=\"\",\"\",Food_Reference!B402)","v":""},{"$f":"IF(Food_Reference!C402=\"\",\"\",Food_Reference!C402)","v":""}]
[{"$f":"IF(Food_Reference!A403=\"\",\"\",Food_Reference!A403)","v":""},{"$f":"IF(Food_Reference!B403=\"\",\"\",Food_Reference!B403)","v":""},{"$f":"IF(Food_Reference!C403=\"\",\"\",Food_Reference!C403)","v":""}]
[{"$f":"IF(Food_Reference!A404=\"\",\"\",Food_Reference!A404)","v":""},{"$f":"IF(Food_Reference!B404=\"\",\"\",Food_Reference!B404)","v":""},{"$f":"IF(Food_Reference!C404=\"\",\"\",Food_Reference!C404)","v":""}]
[{"$f":"IF(Food_Reference!A405=\"\",\"\",Food_Reference!A405)","v":""},{"$f":"IF(Food_Reference!B405=\"\",\"\",Food_Reference!B405)","v":""},{"$f":"IF(Food_Reference!C405=\"\",\"\",Food_Reference!C405)","v":""}]
[{"$f":"IF(Food_Reference!A406=\"\",\"\",Food_Reference!A406)","v":""},{"$f":"IF(Food_Reference!B406=\"\",\"\",Food_Reference!B406)","v":""},{"$f":"IF(Food_Reference!C406=\"\",\"\",Food_Reference!C406)","v":""}]
[{"$f":"IF(Food_Reference!A407=\"\",\"\",Food_Reference!A407)","v":""},{"$f":"IF(Food_Reference!B407=\"\",\"\",Food_Reference!B407)","v":""},{"$f":"IF(Food_Reference!C407=\"\",\"\",Food_Reference!C407)","v":""}]
[{"$f":"IF(Food_Reference!A408=\"\",\"\",Food_Reference!A408)","v":""},{"$f":"IF(Food_Reference!B408=\"\",\"\",Food_Reference!B408)","v":""},{"$f":"IF(Food_Reference!C408=\"\",\"\",Food_Reference!C408)","v":""}]
[{"$f":"IF(Food_Reference!A409=\"\",\"\",Food_Reference!A409)","v":""},{"$f":"IF(Food_Reference!B409=\"\",\"\",Food_Reference!B409)","v":""},{"$f":"IF(Food_Reference!C409=\"\",\"\",Food_Reference!C409)","v":""}]
[{"$f":"IF(Food_Reference!A410=\"\",\"\",Food_Reference!A410)","v":""},{"$f":"IF(Food_Reference!B410=\"\",\"\",Food_Reference!B410)","v":""},{"$f":"IF(Food_Reference!C410=\"\",\"\",Food_Reference!C410)","v":""}]
[{"$f":"IF(Food_Reference!A411=\"\",\"\",Food_Reference!A411)","v":""},{"$f":"IF(Food_Reference!B411=\"\",\"\",Food_Reference!B411)","v":""},{"$f":"IF(Food_Reference!C411=\"\",\"\",Food_Reference!C411)","v":""}]
[{"$f":"IF(Food_Reference!A412=\"\",\"\",Food_Reference!A412)","v":""},{"$f":"IF(Food_Reference!B412=\"\",\"\",Food_Reference!B412)","v":""},{"$f":"IF(Food_Reference!C412=\"\",\"\",Food_Reference!C412)","v":""}]
[{"$f":"IF(Food_Reference!A413=\"\",\"\",Food_Reference!A413)","v":""},{"$f":"IF(Food_Reference!B413=\"\",\"\",Food_Reference!B413)","v":""},{"$f":"IF(Food_Reference!C413=\"\",\"\",Food_Reference!C413)","v":""}]
[{"$f":"IF(Food_Reference!A414=\"\",\"\",Food_Reference!A414)","v":""},{"$f":"IF(Food_Reference!B414=\"\",\"\",Food_Reference!B414)","v":""},{"$f":"IF(Food_Reference!C414=\"\",\"\",Food_Reference!C414)","v":""}]
[{"$f":"IF(Food_Reference!A415=\"\",\"\",Food_Reference!A415)","v":""},{"$f":"IF(Food_Reference!B415=\"\",\"\",Food_Reference!B415)","v":""},{"$f":"IF(Food_Reference!C415=\"\",\"\",Food_Reference!C415)","v":""}]
[{"$f":"IF(Food_Reference!A416=\"\",\"\",Food_Reference!A416)","v":""},{"$f":"IF(Food_Reference!B416=\"\",\"\",Food_Reference!B416)","v":""},{"$f":"IF(Food_Reference!C416=\"\",\"\",Food_Reference!C416)","v":""}]
[{"$f":"IF(Food_Reference!A417=\"\",\"\",Food_Reference!A417)","v":""},{"$f":"IF(Food_Reference!B417=\"\",\"\",Food_Reference!B417)","v":""},{"$f":"IF(Food_Reference!C417=\"\",\"\",Food_Reference!C417)","v":""}]
[{"$f":"IF(Food_Reference!A418=\"\",\"\",Food_Reference!A418)","v":""},{"$f":"IF(Food_Reference!B418=\"\",\"\",Food_Reference!B418)","v":""},{"$f":"IF(Food_Reference!C418=\"\",\"\",Food_Reference!C418)","v":""}]
[{"$f":"IF(Food_Reference!A419=\"\",\"\",Food_Reference!A419)","v":""},{"$f":"IF(Food_Reference!B419=\"\",\"\",Food_Reference!B419)","v":""},{"$f":"IF(Food_Reference!C419=\"\",\"\",Food_Reference!C419)","v":""}]
[{"$f":"IF(Food_Reference!A420=\"\",\"\",Food_Reference!A420)","v":""},{"$f":"IF(Food_Reference!B420=\"\",\"\",Food_Reference!B420)","v":""},{"$f":"IF(Food_Reference!C420=\"\",\"\",Food_Reference!C420)","v":""}]
[{"$f":"IF(Food_Reference!A421=\"\",\"\",Food_Reference!A421)","v":""},{"$f":"IF(Food_Reference!B421=\"\",\"\",Food_Reference!B421)","v":""},{"$f":"IF(Food_Reference!C421=\"\",\"\",Food_Reference!C421)","v":""}]
[{"$f":"IF(Food_Reference!A422=\"\",\"\",Food_Reference!A422)","v":""},{"$f":"IF(Food_Reference!B422=\"\",\"\",Food_Reference!B422)","v":""},{"$f":"IF(Food_Reference!C422=\"\",\"\",Food_Reference!C422)","v":""}]
[{"$f":"IF(Food_Reference!A423=\"\",\"\",Food_Reference!A423)","v":""},{"$f":"IF(Food_Reference!B423=\"\",\"\",Food_Reference!B423)","v":""},{"$f":"IF(Food_Reference!C423=\"\",\"\",Food_Reference!C423)","v":""}]
[{"$f":"IF(Food_Reference!A424=\"\",\"\",Food_Reference!A424)","v":""},{"$f":"IF(Food_Reference!B424=\"\",\"\",Food_Reference!B424)","v":""},{"$f":"IF(Food_Reference!C424=\"\",\"\",Food_Reference!C424)","v":""}]
[{"$f":"IF(Food_Reference!A425=\"\",\"\",Food_Reference!A425)","v":""},{"$f":"IF(Food_Reference!B425=\"\",\"\",Food_Reference!B425)","v":""},{"$f":"IF(Food_Reference!C425=\"\",\"\",Food_Reference!C425)","v":""}]
[{"$f":"IF(Food_Reference!A426=\"\",\"\",Food_Reference!A426)","v":""},{"$f":"IF(Food_Reference!B426=\"\",\"\",Food_Reference!B426)","v":""},{"$f":"IF(Food_Reference!C426=\"\",\"\",Food_Reference!C426)","v":""}]
[{"$f":"IF(Food_Reference!A427=\"\",\"\",Food_Reference!A427)","v":""},{"$f":"IF(Food_Reference!B427=\"\",\"\",Food_Reference!B427)","v":""},{"$f":"IF(Food_Reference!C427=\"\",\"\",Food_Reference!C427)","v":""}]
[{"$f":"IF(Food_Reference!A428=\"\",\"\",Food_Reference!A428)","v":""},{"$f":"IF(Food_Reference!B428=\"\",\"\",Food_Reference!B428)","v":""},{"$f":"IF(Food_Reference!C428=\"\",\"\",Food_Reference!C428)","v":""}]
[{"$f":"IF(Food_Reference!A429=\"\",\"\",Food_Reference!A429)","v":""},{"$f":"IF(Food_Reference!B429=\"\",\"\",Food_Reference!B429)","v":""},{"$f":"IF(Food_Reference!C429=\"\",\"\",Food_Reference!C429)","v":""}]
[{"$f":"IF(Food_Reference!A430=\"\",\"\",Food_Reference!A430)","v":""},{"$f":"IF(Food_Reference!B430=\"\",\"\",Food_Reference!B430)","v":""},{"$f":"IF(Food_Reference!C430=\"\",\"\",Food_Reference!C430)","v":""}]
[{"$f":"IF(Food_Reference!A431=\"\",\"\",Food_Reference!A431)","v":""},{"$f":"IF(Food_Reference!B431=\"\",\"\",Food_Reference!B431)","v":""},{"$f":"IF(Food_Reference!C431=\"\",\"\",Food_Reference!C431)","v":""}]
[{"$f":"IF(Food_Reference!A432=\"\",\"\",Food_Reference!A432)","v":""},{"$f":"IF(Food_Reference!B432=\"\",\"\",Food_Reference!B432)","v":""},{"$f":"IF(Food_Reference!C432=\"\",\"\",Food_Reference!C432)","v":""}]
[{"$f":"IF(Food_Reference!A433=\"\",\"\",Food_Reference!A433)","v":""},{"$f":"IF(Food_Reference!B433=\"\",\"\",Food_Reference!B433)","v":""},{"$f":"IF(Food_Reference!C433=\"\",\"\",Food_Reference!C433)","v":""}]
[{"$f":"IF(Food_Reference!A434=\"\",\"\",Food_Reference!A434)","v":""},{"$f":"IF(Food_Reference!B434=\"\",\"\",Food_Reference!B434)","v":""},{"$f":"IF(Food_Reference!C434=\"\",\"\",Food_Reference!C434)","v":""}]
[{"$f":"IF(Food_Reference!A435=\"\",\"\",Food_Reference!A435)","v":""},{"$f":"IF(Food_Reference!B435=\"\",\"\",Food_Reference!B435)","v":""},{"$f":"IF(Food_Reference!C435=\"\",\"\",Food_Reference!C435)","v":""}]
[{"$f":"IF(Food_Reference!A436=\"\",\"\",Food_Reference!A436)","v":""},{"$f":"IF(Food_Reference!B436=\"\",\"\",Food_Reference!B436)","v":""},{"$f":"IF(Food_Reference!C436=\"\",\"\",Food_Reference!C436)","v":""}]
[{"$f":"IF(Food_Reference!A437=\"\",\"\",Food_Reference!A437)","v":""},{"$f":"IF(Food_Reference!B437=\"\",\"\",Food_Reference!B437)","v":""},{"$f":"IF(Food_Reference!C437=\"\",\"\",Food_Reference!C437)","v":""}]
[{"$f":"IF(Food_Reference!A438=\"\",\"\",Food_Reference!A438)","v":""},{"$f":"IF(Food_Reference!B438=\"\",\"\",Food_Reference!B438)","v":""},{"$f":"IF(Food_Reference!C438=\"\",\"\",Food_Reference!C438)","v":""}]
[{"$f":"IF(Food_Reference!A439=\"\",\"\",Food_Reference!A439)","v":""},{"$f":"IF(Food_Reference!B439=\"\",\"\",Food_Reference!B439)","v":""},{"$f":"IF(Food_Reference!C439=\"\",\"\",Food_Reference!C439)","v":""}]
[{"$f":"IF(Food_Reference!A440=\"\",\"\",Food_Reference!A440)","v":""},{"$f":"IF(Food_Reference!B440=\"\",\"\",Food_Reference!B440)","v":""},{"$f":"IF(Food_Reference!C440=\"\",\"\",Food_Reference!C440)","v":""}]
[{"$f":"IF(Food_Reference!A441=\"\",\"\",Food_Reference!A441)","v":""},{"$f":"IF(Food_Reference!B441=\"\",\"\",Food_Reference!B441)","v":""},{"$f":"IF(Food_Reference!C441=\"\",\"\",Food_Reference!C441)","v":""}]
[{"$f":"IF(Food_Reference!A442=\"\",\"\",Food_Reference!A442)","v":""},{"$f":"IF(Food_Reference!B442=\"\",\"\",Food_Reference!B442)","v":""},{"$f":"IF(Food_Reference!C442=\"\",\"\",Food_Reference!C442)","v":""}]
[{"$f":"IF(Food_Reference!A443=\"\",\"\",Food_Reference!A443)","v":""},{"$f":"IF(Food_Reference!B443=\"\",\"\",Food_Reference!B443)","v":""},{"$f":"IF(Food_Reference!C443=\"\",\"\",Food_Reference!C443)","v":""}]
[{"$f":"IF(Food_Reference!A444=\"\",\"\",Food_Reference!A444)","v":""},{"$f":"IF(Food_Reference!B444=\"\",\"\",Food_Reference!B444)","v":""},{"$f":"IF(Food_Reference!C444=\"\",\"\",Food_Reference!C444)","v":""}]
[{"$f":"IF(Food_Reference!A445=\"\",\"\",Food_Reference!A445)","v":""},{"$f":"IF(Food_Reference!B445=\"\",\"\",Food_Reference!B445)","v":""},{"$f":"IF(Food_Reference!C445=\"\",\"\",Food_Reference!C445)","v":""}]
[{"$f":"IF(Food_Reference!A446=\"\",\"\",Food_Reference!A446)","v":""},{"$f":"IF(Food_Reference!B446=\"\",\"\",Food_Reference!B446)","v":""},{"$f":"IF(Food_Reference!C446=\"\",\"\",Food_Reference!C446)","v":""}]
[{"$f":"IF(Food_Reference!A447=\"\",\"\",Food_Reference!A447)","v":""},{"$f":"IF(Food_Reference!B447=\"\",\"\",Food_Reference!B447)","v":""},{"$f":"IF(Food_Reference!C447=\"\",\"\",Food_Reference!C447)","v":""}]
[{"$f":"IF(Food_Reference!A448=\"\",\"\",Food_Reference!A448)","v":""},{"$f":"IF(Food_Reference!B448=\"\",\"\",Food_Reference!B448)","v":""},{"$f":"IF(Food_Reference!C448=\"\",\"\",Food_Reference!C448)","v":""}]
[{"$f":"IF(Food_Reference!A449=\"\",\"\",Food_Reference!A449)","v":""},{"$f":"IF(Food_Reference!B449=\"\",\"\",Food_Reference!B449)","v":""},{"$f":"IF(Food_Reference!C449=\"\",\"\",Food_Reference!C449)","v":""}]
[{"$f":"IF(Food_Reference!A450=\"\",\"\",Food_Reference!A450)","v":""},{"$f":"IF(Food_Reference!B450=\"\",\"\",Food_Reference!B450)","v":""},{"$f":"IF(Food_Reference!C450=\"\",\"\",Food_Reference!C450)","v":""}]
[{"$f":"IF(Food_Reference!A451=\"\",\"\",Food_Reference!A451)","v":""},{"$f":"IF(Food_Reference!B451=\"\",\"\",Food_Reference!B451)","v":""},{"$f":"IF(Food_Reference!C451=\"\",\"\",Food_Reference!C451)","v":""}]
[{"$f":"IF(Food_Reference!A452=\"\",\"\",Food_Reference!A452)","v":""},{"$f":"IF(Food_Reference!B452=\"\",\"\",Food_Reference!B452)","v":""},{"$f":"IF(Food_Reference!C452=\"\",\"\",Food_Reference!C452)","v":""}]
[{"$f":"IF(Food_Reference!A453=\"\",\"\",Food_Reference!A453)","v":""},{"$f":"IF(Food_Reference!B453=\"\",\"\",Food_Reference!B453)","v":""},{"$f":"IF(Food_Reference!C453=\"\",\"\",Food_Reference!C453)","v":""}]
[{"$f":"IF(Food_Reference!A454=\"\",\"\",Food_Reference!A454)","v":""},{"$f":"IF(Food_Reference!B454=\"\",\"\",Food_Reference!B454)","v":""},{"$f":"IF(Food_Reference!C454=\"\",\"\",Food_Reference!C454)","v":""}]
[{"$f":"IF(Food_Reference!A455=\"\",\"\",Food_Reference!A455)","v":""},{"$f":"IF(Food_Reference!B455=\"\",\"\",Food_Reference!B455)","v":""},{"$f":"IF(Food_Reference!C455=\"\",\"\",Food_Reference!C455)","v":""}]
[{"$f":"IF(Food_Reference!A456=\"\",\"\",Food_Reference!A456)","v":""},{"$f":"IF(Food_Reference!B456=\"\",\"\",Food_Reference!B456)","v":""},{"$f":"IF(Food_Reference!C456=\"\",\"\",Food_Reference!C456)","v":""}]
[{"$f":"IF(Food_Reference!A457=\"\",\"\",Food_Reference!A457)","v":""},{"$f":"IF(Food_Reference!B457=\"\",\"\",Food_Reference!B457)","v":""},{"$f":"IF(Food_Reference!C457=\"\",\"\",Food_Reference!C457)","v":""}]
[{"$f":"IF(Food_Reference!A458=\"\",\"\",Food_Reference!A458)","v":""},{"$f":"IF(Food_Reference!B458=\"\",\"\",Food_Reference!B458)","v":""},{"$f":"IF(Food_Reference!C458=\"\",\"\",Food_Reference!C458)","v":""}]
[{"$f":"IF(Food_Reference!A459=\"\",\"\",Food_Reference!A459)","v":""},{"$f":"IF(Food_Reference!B459=\"\",\"\",Food_Reference!B459)","v":""},{"$f":"IF(Food_Reference!C459=\"\",\"\",Food_Reference!C459)","v":""}]
[{"$f":"IF(Food_Reference!A460=\"\",\"\",Food_Reference!A460)","v":""},{"$f":"IF(Food_Reference!B460=\"\",\"\",Food_Reference!B460)","v":""},{"$f":"IF(Food_Reference!C460=\"\",\"\",Food_Reference!C460)","v":""}]
[{"$f":"IF(Food_Reference!A461=\"\",\"\",Food_Reference!A461)","v":""},{"$f":"IF(Food_Reference!B461=\"\",\"\",Food_Reference!B461)","v":""},{"$f":"IF(Food_Reference!C461=\"\",\"\",Food_Reference!C461)","v":""}]
[{"$f":"IF(Food_Reference!A462=\"\",\"\",Food_Reference!A462)","v":""},{"$f":"IF(Food_Reference!B462=\"\",\"\",Food_Reference!B462)","v":""},{"$f":"IF(Food_Reference!C462=\"\",\"\",Food_Reference!C462)","v":""}]
[{"$f":"IF(Food_Reference!A463=\"\",\"\",Food_Reference!A463)","v":""},{"$f":"IF(Food_Reference!B463=\"\",\"\",Food_Reference!B463)","v":""},{"$f":"IF(Food_Reference!C463=\"\",\"\",Food_Reference!C463)","v":""}]
[{"$f":"IF(Food_Reference!A464=\"\",\"\",Food_Reference!A464)","v":""},{"$f":"IF(Food_Reference!B464=\"\",\"\",Food_Reference!B464)","v":""},{"$f":"IF(Food_Reference!C464=\"\",\"\",Food_Reference!C464)","v":""}]
[{"$f":"IF(Food_Reference!A465=\"\",\"\",Food_Reference!A465)","v":""},{"$f":"IF(Food_Reference!B465=\"\",\"\",Food_Reference!B465)","v":""},{"$f":"IF(Food_Reference!C465=\"\",\"\",Food_Reference!C465)","v":""}]
[{"$f":"IF(Food_Reference!A466=\"\",\"\",Food_Reference!A466)","v":""},{"$f":"IF(Food_Reference!B466=\"\",\"\",Food_Reference!B466)","v":""},{"$f":"IF(Food_Reference!C466=\"\",\"\",Food_Reference!C466)","v":""}]
[{"$f":"IF(Food_Reference!A467=\"\",\"\",Food_Reference!A467)","v":""},{"$f":"IF(Food_Reference!B467=\"\",\"\",Food_Reference!B467)","v":""},{"$f":"IF(Food_Reference!C467=\"\",\"\",Food_Reference!C467)","v":""}]
[{"$f":"IF(Food_Reference!A468=\"\",\"\",Food_Reference!A468)","v":""},{"$f":"IF(Food_Reference!B468=\"\",\"\",Food_Reference!B468)","v":""},{"$f":"IF(Food_Reference!C468=\"\",\"\",Food_Reference!C468)","v":""}]
[{"$f":"IF(Food_Reference!A469=\"\",\"\",Food_Reference!A469)","v":""},{"$f":"IF(Food_Reference!B469=\"\",\"\",Food_Reference!B469)","v":""},{"$f":"IF(Food_Reference!C469=\"\",\"\",Food_Reference!C469)","v":""}]
[{"$f":"IF(Food_Reference!A470=\"\",\"\",Food_Reference!A470)","v":""},{"$f":"IF(Food_Reference!B470=\"\",\"\",Food_Reference!B470)","v":""},{"$f":"IF(Food_Reference!C470=\"\",\"\",Food_Reference!C470)","v":""}]
[{"$f":"IF(Food_Reference!A471=\"\",\"\",Food_Reference!A471)","v":""},{"$f":"IF(Food_Reference!B471=\"\",\"\",Food_Reference!B471)","v":""},{"$f":"IF(Food_Reference!C471=\"\",\"\",Food_Reference!C471)","v":""}]
[{"$f":"IF(Food_Reference!A472=\"\",\"\",Food_Reference!A472)","v":""},{"$f":"IF(Food_Reference!B472=\"\",\"\",Food_Reference!B472)","v":""},{"$f":"IF(Food_Reference!C472=\"\",\"\",Food_Reference!C472)","v":""}]
[{"$f":"IF(Food_Reference!A473=\"\",\"\",Food_Reference!A473)","v":""},{"$f":"IF(Food_Reference!B473=\"\",\"\",Food_Reference!B473)","v":""},{"$f":"IF(Food_Reference!C473=\"\",\"\",Food_Reference!C473)","v":""}]
[{"$f":"IF(Food_Reference!A474=\"\",\"\",Food_Reference!A474)","v":""},{"$f":"IF(Food_Reference!B474=\"\",\"\",Food_Reference!B474)","v":""},{"$f":"IF(Food_Reference!C474=\"\",\"\",Food_Reference!C474)","v":""}]
[{"$f":"IF(Food_Reference!A475=\"\",\"\",Food_Reference!A475)","v":""},{"$f":"IF(Food_Reference!B475=\"\",\"\",Food_Reference!B475)","v":""},{"$f":"IF(Food_Reference!C475=\"\",\"\",Food_Reference!C475)","v":""}]
[{"$f":"IF(Food_Reference!A476=\"\",\"\",Food_Reference!A476)","v":""},{"$f":"IF(Food_Reference!B476=\"\",\"\",Food_Reference!B476)","v":""},{"$f":"IF(Food_Reference!C476=\"\",\"\",Food_Reference!C476)","v":""}]
[{"$f":"IF(Food_Reference!A477=\"\",\"\",Food_Reference!A477)","v":""},{"$f":"IF(Food_Reference!B477=\"\",\"\",Food_Reference!B477)","v":""},{"$f":"IF(Food_Reference!C477=\"\",\"\",Food_Reference!C477)","v":""}]
[{"$f":"IF(Food_Reference!A478=\"\",\"\",Food_Reference!A478)","v":""},{"$f":"IF(Food_Reference!B478=\"\",\"\",Food_Reference!B478)","v":""},{"$f":"IF(Food_Reference!C478=\"\",\"\",Food_Reference!C478)","v":""}]
[{"$f":"IF(Food_Reference!A479=\"\",\"\",Food_Reference!A479)","v":""},{"$f":"IF(Food_Reference!B479=\"\",\"\",Food_Reference!B479)","v":""},{"$f":"IF(Food_Reference!C479=\"\",\"\",Food_Reference!C479)","v":""}]
[{"$f":"IF(Food_Reference!A480=\"\",\"\",Food_Reference!A480)","v":""},{"$f":"IF(Food_Reference!B480=\"\",\"\",Food_Reference!B480)","v":""},{"$f":"IF(Food_Reference!C480=\"\",\"\",Food_Reference!C480)","v":""}]
[{"$f":"IF(Food_Reference!A481=\"\",\"\",Food_Reference!A481)","v":""},{"$f":"IF(Food_Reference!B481=\"\",\"\",Food_Reference!B481)","v":""},{"$f":"IF(Food_Reference!C481=\"\",\"\",Food_Reference!C481)","v":""}]
[{"$f":"IF(Food_Reference!A482=\"\",\"\",Food_Reference!A482)","v":""},{"$f":"IF(Food_Reference!B482=\"\",\"\",Food_Reference!B482)","v":""},{"$f":"IF(Food_Reference!C482=\"\",\"\",Food_Reference!C482)","v":""}]
[{"$f":"IF(Food_Reference!A483=\"\",\"\",Food_Reference!A483)","v":""},{"$f":"IF(Food_Reference!B483=\"\",\"\",Food_Reference!B483)","v":""},{"$f":"IF(Food_Reference!C483=\"\",\"\",Food_Reference!C483)","v":""}]
[{"$f":"IF(Food_Reference!A484=\"\",\"\",Food_Reference!A484)","v":""},{"$f":"IF(Food_Reference!B484=\"\",\"\",Food_Reference!B484)","v":""},{"$f":"IF(Food_Reference!C484=\"\",\"\",Food_Reference!C484)","v":""}]
[{"$f":"IF(Food_Reference!A485=\"\",\"\",Food_Reference!A485)","v":""},{"$f":"IF(Food_Reference!B485=\"\",\"\",Food_Reference!B485)","v":""},{"$f":"IF(Food_Reference!C485=\"\",\"\",Food_Reference!C485)","v":""}]
[{"$f":"IF(Food_Reference!A486=\"\",\"\",Food_Reference!A486)","v":""},{"$f":"IF(Food_Reference!B486=\"\",\"\",Food_Reference!B486)","v":""},{"$f":"IF(Food_Reference!C486=\"\",\"\",Food_Reference!C486)","v":""}]
[{"$f":"IF(Food_Reference!A487=\"\",\"\",Food_Reference!A487)","v":""},{"$f":"IF(Food_Reference!B487=\"\",\"\",Food_Reference!B487)","v":""},{"$f":"IF(Food_Reference!C487=\"\",\"\",Food_Reference!C487)","v":""}]
[{"$f":"IF(Food_Reference!A488=\"\",\"\",Food_Reference!A488)","v":""},{"$f":"IF(Food_Reference!B488=\"\",\"\",Food_Reference!B488)","v":""},{"$f":"IF(Food_Reference!C488=\"\",\"\",Food_Reference!C488)","v":""}]
[{"$f":"IF(Food_Reference!A489=\"\",\"\",Food_Reference!A489)","v":""},{"$f":"IF(Food_Reference!B489=\"\",\"\",Food_Reference!B489)","v":""},{"$f":"IF(Food_Reference!C489=\"\",\"\",Food_Reference!C489)","v":""}]
[{"$f":"IF(Food_Reference!A490=\"\",\"\",Food_Reference!A490)","v":""},{"$f":"IF(Food_Reference!B490=\"\",\"\",Food_Reference!B490)","v":""},{"$f":"IF(Food_Reference!C490=\"\",\"\",Food_Reference!C490)","v":""}]
[{"$f":"IF(Food_Reference!A491=\"\",\"\",Food_Reference!A491)","v":""},{"$f":"IF(Food_Reference!B491=\"\",\"\",Food_Reference!B491)","v":""},{"$f":"IF(Food_Reference!C491=\"\",\"\",Food_Reference!C491)","v":""}]
[{"$f":"IF(Food_Reference!A492=\"\",\"\",Food_Reference!A492)","v":""},{"$f":"IF(Food_Reference!B492=\"\",\"\",Food_Reference!B492)","v":""},{"$f":"IF(Food_Reference!C492=\"\",\"\",Food_Reference!C492)","v":""}]
[{"$f":"IF(Food_Reference!A493=\"\",\"\",Food_Reference!A493)","v":""},{"$f":"IF(Food_Reference!B493=\"\",\"\",Food_Reference!B493)","v":""},{"$f":"IF(Food_Reference!C493=\"\",\"\",Food_Reference!C493)","v":""}]
[{"$f":"IF(Food_Reference!A494=\"\",\"\",Food_Reference!A494)","v":""},{"$f":"IF(Food_Reference!B494=\"\",\"\",Food_Reference!B494)","v":""},{"$f":"IF(Food_Reference!C494=\"\",\"\",Food_Reference!C494)","v":""}]
[{"$f":"IF(Food_Reference!A495=\"\",\"\",Food_Reference!A495)","v":""},{"$f":"IF(Food_Reference!B495=\"\",\"\",Food_Reference!B495)","v":""},{"$f":"IF(Food_Reference!C495=\"\",\"\",Food_Reference!C495)","v":""}]
[{"$f":"IF(Food_Reference!A496=\"\",\"\",Food_Reference!A496)","v":""},{"$f":"IF(Food_Reference!B496=\"\",\"\",Food_Reference!B496)","v":""},{"$f":"IF(Food_Reference!C496=\"\",\"\",Food_Reference!C496)","v":""}]
[{"$f":"IF(Food_Reference!A497=\"\",\"\",Food_Reference!A497)","v":""},{"$f":"IF(Food_Reference!B497=\"\",\"\",Food_Reference!B497)","v":""},{"$f":"IF(Food_Reference!C497=\"\",\"\",Food_Reference!C497)","v":""}]
[{"$f":"IF(Food_Reference!A498=\"\",\"\",Food_Reference!A498)","v":""},{"$f":"IF(Food_Reference!B498=\"\",\"\",Food_Reference!B498)","v":""},{"$f":"IF(Food_Reference!C498=\"\",\"\",Food_Reference!C498)","v":""}]
[{"$f":"IF(Food_Reference!A499=\"\",\"\",Food_Reference!A499)","v":""},{"$f":"IF(Food_Reference!B499=\"\",\"\",Food_Reference!B499)","v":""},{"$f":"IF(Food_Reference!C499=\"\",\"\",Food_Reference!C499)","v":""}]
[{"$f":"IF(Food_Reference!A500=\"\",\"\",Food_Reference!A500)","v":""},{"$f":"IF(Food_Reference!B500=\"\",\"\",Food_Reference!B500)","v":""},{"$f":"IF(Food_Reference!C500=\"\",\"\",Food_Reference!C500)","v":""}]
[{"$f":"IF(Food_Reference!A501=\"\",\"\",Food_Reference!A501)","v":""},{"$f":"IF(Food_Reference!B501=\"\",\"\",Food_Reference!B501)","v":""},{"$f":"IF(Food_Reference!C501=\"\",\"\",Food_Reference!C501)","v":""}]
[{"$f":"IF(Food_Reference!A502=\"\",\"\",Food_Reference!A502)","v":""},{"$f":"IF(Food_Reference!B502=\"\",\"\",Food_Reference!B502)","v":""},{"$f":"IF(Food_Reference!C502=\"\",\"\",Food_Reference!C502)","v":""}]
[{"$f":"IF(Food_Reference!A503=\"\",\"\",Food_Reference!A503)","v":""},{"$f":"IF(Food_Reference!B503=\"\",\"\",Food_Reference!B503)","v":""},{"$f":"IF(Food_Reference!C503=\"\",\"\",Food_Reference!C503)","v":""}]
[{"$f":"IF(Food_Reference!A504=\"\",\"\",Food_Reference!A504)","v":""},{"$f":"IF(Food_Reference!B504=\"\",\"\",Food_Reference!B504)","v":""},{"$f":"IF(Food_Reference!C504=\"\",\"\",Food_Reference!C504)","v":""}]
[{"$f":"IF(Food_Reference!A505=\"\",\"\",Food_Reference!A505)","v":""},{"$f":"IF(Food_Reference!B505=\"\",\"\",Food_Reference!B505)","v":""},{"$f":"IF(Food_Reference!C505=\"\",\"\",Food_Reference!C505)","v":""}]
[{"$f":"IF(Food_Reference!A506=\"\",\"\",Food_Reference!A506)","v":""},{"$f":"IF(Food_Reference!B506=\"\",\"\",Food_Reference!B506)","v":""},{"$f":"IF(Food_Reference!C506=\"\",\"\",Food_Reference!C506)","v":""}]
[{"$f":"IF(Food_Reference!A507=\"\",\"\",Food_Reference!A507)","v":""},{"$f":"IF(Food_Reference!B507=\"\",\"\",Food_Reference!B507)","v":""},{"$f":"IF(Food_Reference!C507=\"\",\"\",Food_Reference!C507)","v":""}]
[{"$f":"IF(Food_Reference!A508=\"\",\"\",Food_Reference!A508)","v":""},{"$f":"IF(Food_Reference!B508=\"\",\"\",Food_Reference!B508)","v":""},{"$f":"IF(Food_Reference!C508=\"\",\"\",Food_Reference!C508)","v":""}]
[{"$f":"IF(Food_Reference!A509=\"\",\"\",Food_Reference!A509)","v":""},{"$f":"IF(Food_Reference!B509=\"\",\"\",Food_Reference!B509)","v":""},{"$f":"IF(Food_Reference!C509=\"\",\"\",Food_Reference!C509)","v":""}]
[{"$f":"IF(Food_Reference!A510=\"\",\"\",Food_Reference!A510)","v":""},{"$f":"IF(Food_Reference!B510=\"\",\"\",Food_Reference!B510)","v":""},{"$f":"IF(Food_Reference!C510=\"\",\"\",Food_Reference!C510)","v":""}]
[{"$f":"IF(Food_Reference!A511=\"\",\"\",Food_Reference!A511)","v":""},{"$f":"IF(Food_Reference!B511=\"\",\"\",Food_Reference!B511)","v":""},{"$f":"IF(Food_Reference!C511=\"\",\"\",Food_Reference!C511)","v":""}]
[{"$f":"IF(Food_Reference!A512=\"\",\"\",Food_Reference!A512)","v":""},{"$f":"IF(Food_Reference!B512=\"\",\"\",Food_Reference!B512)","v":""},{"$f":"IF(Food_Reference!C512=\"\",\"\",Food_Reference!C512)","v":""}]
[{"$f":"IF(Food_Reference!A513=\"\",\"\",Food_Reference!A513)","v":""},{"$f":"IF(Food_Reference!B513=\"\",\"\",Food_Reference!B513)","v":""},{"$f":"IF(Food_Reference!C513=\"\",\"\",Food_Reference!C513)","v":""}]
[{"$f":"IF(Food_Reference!A514=\"\",\"\",Food_Reference!A514)","v":""},{"$f":"IF(Food_Reference!B514=\"\",\"\",Food_Reference!B514)","v":""},{"$f":"IF(Food_Reference!C514=\"\",\"\",Food_Reference!C514)","v":""}]
[{"$f":"IF(Food_Reference!A515=\"\",\"\",Food_Reference!A515)","v":""},{"$f":"IF(Food_Reference!B515=\"\",\"\",Food_Reference!B515)","v":""},{"$f":"IF(Food_Reference!C515=\"\",\"\",Food_Reference!C515)","v":""}]
[{"$f":"IF(Food_Reference!A516=\"\",\"\",Food_Reference!A516)","v":""},{"$f":"IF(Food_Reference!B516=\"\",\"\",Food_Reference!B516)","v":""},{"$f":"IF(Food_Reference!C516=\"\",\"\",Food_Reference!C516)","v":""}]
[{"$f":"IF(Food_Reference!A517=\"\",\"\",Food_Reference!A517)","v":""},{"$f":"IF(Food_Reference!B517=\"\",\"\",Food_Reference!B517)","v":""},{"$f":"IF(Food_Reference!C517=\"\",\"\",Food_Reference!C517)","v":""}]
[{"$f":"IF(Food_Reference!A518=\"\",\"\",Food_Reference!A518)","v":""},{"$f":"IF(Food_Reference!B518=\"\",\"\",Food_Reference!B518)","v":""},{"$f":"IF(Food_Reference!C518=\"\",\"\",Food_Reference!C518)","v":""}]
[{"$f":"IF(Food_Reference!A519=\"\",\"\",Food_Reference!A519)","v":""},{"$f":"IF(Food_Reference!B519=\"\",\"\",Food_Reference!B519)","v":""},{"$f":"IF(Food_Reference!C519=\"\",\"\",Food_Reference!C519)","v":""}]
[{"$f":"IF(Food_Reference!A520=\"\",\"\",Food_Reference!A520)","v":""},{"$f":"IF(Food_Reference!B520=\"\",\"\",Food_Reference!B520)","v":""},{"$f":"IF(Food_Reference!C520=\"\",\"\",Food_Reference!C520)","v":""}]
[{"$f":"IF(Food_Reference!A521=\"\",\"\",Food_Reference!A521)","v":""},{"$f":"IF(Food_Reference!B521=\"\",\"\",Food_Reference!B521)","v":""},{"$f":"IF(Food_Reference!C521=\"\",\"\",Food_Reference!C521)","v":""}]
[{"$f":"IF(Food_Reference!A522=\"\",\"\",Food_Reference!A522)","v":""},{"$f":"IF(Food_Reference!B522=\"\",\"\",Food_Reference!B522)","v":""},{"$f":"IF(Food_Reference!C522=\"\",\"\",Food_Reference!C522)","v":""}]
[{"$f":"IF(Food_Reference!A523=\"\",\"\",Food_Reference!A523)","v":""},{"$f":"IF(Food_Reference!B523=\"\",\"\",Food_Reference!B523)","v":""},{"$f":"IF(Food_Reference!C523=\"\",\"\",Food_Reference!C523)","v":""}]
[{"$f":"IF(Food_Reference!A524=\"\",\"\",Food_Reference!A524)","v":""},{"$f":"IF(Food_Reference!B524=\"\",\"\",Food_Reference!B524)","v":""},{"$f":"IF(Food_Reference!C524=\"\",\"\",Food_Reference!C524)","v":""}]
[{"$f":"IF(Food_Reference!A525=\"\",\"\",Food_Reference!A525)","v":""},{"$f":"IF(Food_Reference!B525=\"\",\"\",Food_Reference!B525)","v":""},{"$f":"IF(Food_Reference!C525=\"\",\"\",Food_Reference!C525)","v":""}]
[{"$f":"IF(Food_Reference!A526=\"\",\"\",Food_Reference!A526)","v":""},{"$f":"IF(Food_Reference!B526=\"\",\"\",Food_Reference!B526)","v":""},{"$f":"IF(Food_Reference!C526=\"\",\"\",Food_Reference!C526)","v":""}]
[{"$f":"IF(Food_Reference!A527=\"\",\"\",Food_Reference!A527)","v":""},{"$f":"IF(Food_Reference!B527=\"\",\"\",Food_Reference!B527)","v":""},{"$f":"IF(Food_Reference!C527=\"\",\"\",Food_Reference!C527)","v":""}]
[{"$f":"IF(Food_Reference!A528=\"\",\"\",Food_Reference!A528)","v":""},{"$f":"IF(Food_Reference!B528=\"\",\"\",Food_Reference!B528)","v":""},{"$f":"IF(Food_Reference!C528=\"\",\"\",Food_Reference!C528)","v":""}]
[{"$f":"IF(Food_Reference!A529=\"\",\"\",Food_Reference!A529)","v":""},{"$f":"IF(Food_Reference!B529=\"\",\"\",Food_Reference!B529)","v":""},{"$f":"IF(Food_Reference!C529=\"\",\"\",Food_Reference!C529)","v":""}]
[{"$f":"IF(Food_Reference!A530=\"\",\"\",Food_Reference!A530)","v":""},{"$f":"IF(Food_Reference!B530=\"\",\"\",Food_Reference!B530)","v":""},{"$f":"IF(Food_Reference!C530=\"\",\"\",Food_Reference!C530)","v":""}]
[{"$f":"IF(Food_Reference!A531=\"\",\"\",Food_Reference!A531)","v":""},{"$f":"IF(Food_Reference!B531=\"\",\"\",Food_Reference!B531)","v":""},{"$f":"IF(Food_Reference!C531=\"\",\"\",Food_Reference!C531)","v":""}]
[{"$f":"IF(Food_Reference!A532=\"\",\"\",Food_Reference!A532)","v":""},{"$f":"IF(Food_Reference!B532=\"\",\"\",Food_Reference!B532)","v":""},{"$f":"IF(Food_Reference!C532=\"\",\"\",Food_Reference!C532)","v":""}]
[{"$f":"IF(Food_Reference!A533=\"\",\"\",Food_Reference!A533)","v":""},{"$f":"IF(Food_Reference!B533=\"\",\"\",Food_Reference!B533)","v":""},{"$f":"IF(Food_Reference!C533=\"\",\"\",Food_Reference!C533)","v":""}]
[{"$f":"IF(Food_Reference!A534=\"\",\"\",Food_Reference!A534)","v":""},{"$f":"IF(Food_Reference!B534=\"\",\"\",Food_Reference!B534)","v":""},{"$f":"IF(Food_Reference!C534=\"\",\"\",Food_Reference!C534)","v":""}]
[{"$f":"IF(Food_Reference!A535=\"\",\"\",Food_Reference!A535)","v":""},{"$f":"IF(Food_Reference!B535=\"\",\"\",Food_Reference!B535)","v":""},{"$f":"IF(Food_Reference!C535=\"\",\"\",Food_Reference!C535)","v":""}]
[{"$f":"IF(Food_Reference!A536=\"\",\"\",Food_Reference!A536)","v":""},{"$f":"IF(Food_Reference!B536=\"\",\"\",Food_Reference!B536)","v":""},{"$f":"IF(Food_Reference!C536=\"\",\"\",Food_Reference!C536)","v":""}]
[{"$f":"IF(Food_Reference!A537=\"\",\"\",Food_Reference!A537)","v":""},{"$f":"IF(Food_Reference!B537=\"\",\"\",Food_Reference!B537)","v":""},{"$f":"IF(Food_Reference!C537=\"\",\"\",Food_Reference!C537)","v":""}]
[{"$f":"IF(Food_Reference!A538=\"\",\"\",Food_Reference!A538)","v":""},{"$f":"IF(Food_Reference!B538=\"\",\"\",Food_Reference!B538)","v":""},{"$f":"IF(Food_Reference!C538=\"\",\"\",Food_Reference!C538)","v":""}]
[{"$f":"IF(Food_Reference!A539=\"\",\"\",Food_Reference!A539)","v":""},{"$f":"IF(Food_Reference!B539=\"\",\"\",Food_Reference!B539)","v":""},{"$f":"IF(Food_Reference!C539=\"\",\"\",Food_Reference!C539)","v":""}]
[{"$f":"IF(Food_Reference!A540=\"\",\"\",Food_Reference!A540)","v":""},{"$f":"IF(Food_Reference!B540=\"\",\"\",Food_Reference!B540)","v":""},{"$f":"IF(Food_Reference!C540=\"\",\"\",Food_Reference!C540)","v":""}]
[{"$f":"IF(Food_Reference!A541=\"\",\"\",Food_Reference!A541)","v":""},{"$f":"IF(Food_Reference!B541=\"\",\"\",Food_Reference!B541)","v":""},{"$f":"IF(Food_Reference!C541=\"\",\"\",Food_Reference!C541)","v":""}]
[{"$f":"IF(Food_Reference!A542=\"\",\"\",Food_Reference!A542)","v":""},{"$f":"IF(Food_Reference!B542=\"\",\"\",Food_Reference!B542)","v":""},{"$f":"IF(Food_Reference!C542=\"\",\"\",Food_Reference!C542)","v":""}]
[{"$f":"IF(Food_Reference!A543=\"\",\"\",Food_Reference!A543)","v":""},{"$f":"IF(Food_Reference!B543=\"\",\"\",Food_Reference!B543)","v":""},{"$f":"IF(Food_Reference!C543=\"\",\"\",Food_Reference!C543)","v":""}]
[{"$f":"IF(Food_Reference!A544=\"\",\"\",Food_Reference!A544)","v":""},{"$f":"IF(Food_Reference!B544=\"\",\"\",Food_Reference!B544)","v":""},{"$f":"IF(Food_Reference!C544=\"\",\"\",Food_Reference!C544)","v":""}]
[{"$f":"IF(Food_Reference!A545=\"\",\"\",Food_Reference!A545)","v":""},{"$f":"IF(Food_Reference!B545=\"\",\"\",Food_Reference!B545)","v":""},{"$f":"IF(Food_Reference!C545=\"\",\"\",Food_Reference!C545)","v":""}]
[{"$f":"IF(Food_Reference!A546=\"\",\"\",Food_Reference!A546)","v":""},{"$f":"IF(Food_Reference!B546=\"\",\"\",Food_Reference!B546)","v":""},{"$f":"IF(Food_Reference!C546=\"\",\"\",Food_Reference!C546)","v":""}]
[{"$f":"IF(Food_Reference!A547=\"\",\"\",Food_Reference!A547)","v":""},{"$f":"IF(Food_Reference!B547=\"\",\"\",Food_Reference!B547)","v":""},{"$f":"IF(Food_Reference!C547=\"\",\"\",Food_Reference!C547)","v":""}]
[{"$f":"IF(Food_Reference!A548=\"\",\"\",Food_Reference!A548)","v":""},{"$f":"IF(Food_Reference!B548=\"\",\"\",Food_Reference!B548)","v":""},{"$f":"IF(Food_Reference!C548=\"\",\"\",Food_Reference!C548)","v":""}]
[{"$f":"IF(Food_Reference!A549=\"\",\"\",Food_Reference!A549)","v":""},{"$f":"IF(Food_Reference!B549=\"\",\"\",Food_Reference!B549)","v":""},{"$f":"IF(Food_Reference!C549=\"\",\"\",Food_Reference!C549)","v":""}]
[{"$f":"IF(Food_Reference!A550=\"\",\"\",Food_Reference!A550)","v":""},{"$f":"IF(Food_Reference!B550=\"\",\"\",Food_Reference!B550)","v":""},{"$f":"IF(Food_Reference!C550=\"\",\"\",Food_Reference!C550)","v":""}]
[{"$f":"IF(Food_Reference!A551=\"\",\"\",Food_Reference!A551)","v":""},{"$f":"IF(Food_Reference!B551=\"\",\"\",Food_Reference!B551)","v":""},{"$f":"IF(Food_Reference!C551=\"\",\"\",Food_Reference!C551)","v":""}]
[{"$f":"IF(Food_Reference!A552=\"\",\"\",Food_Reference!A552)","v":""},{"$f":"IF(Food_Reference!B552=\"\",\"\",Food_Reference!B552)","v":""},{"$f":"IF(Food_Reference!C552=\"\",\"\",Food_Reference!C552)","v":""}]
[{"$f":"IF(Food_Reference!A553=\"\",\"\",Food_Reference!A553)","v":""},{"$f":"IF(Food_Reference!B553=\"\",\"\",Food_Reference!B553)","v":""},{"$f":"IF(Food_Reference!C553=\"\",\"\",Food_Reference!C553)","v":""}]
[{"$f":"IF(Food_Reference!A554=\"\",\"\",Food_Reference!A554)","v":""},{"$f":"IF(Food_Reference!B554=\"\",\"\",Food_Reference!B554)","v":""},{"$f":"IF(Food_Reference!C554=\"\",\"\",Food_Reference!C554)","v":""}]
[{"$f":"IF(Food_Reference!A555=\"\",\"\",Food_Reference!A555)","v":""},{"$f":"IF(Food_Reference!B555=\"\",\"\",Food_Reference!B555)","v":""},{"$f":"IF(Food_Reference!C555=\"\",\"\",Food_Reference!C555)","v":""}]
[{"$f":"IF(Food_Reference!A556=\"\",\"\",Food_Reference!A556)","v":""},{"$f":"IF(Food_Reference!B556=\"\",\"\",Food_Reference!B556)","v":""},{"$f":"IF(Food_Reference!C556=\"\",\"\",Food_Reference!C556)","v":""}]
[{"$f":"IF(Food_Reference!A557=\"\",\"\",Food_Reference!A557)","v":""},{"$f":"IF(Food_Reference!B557=\"\",\"\",Food_Reference!B557)","v":""},{"$f":"IF(Food_Reference!C557=\"\",\"\",Food_Reference!C557)","v":""}]
[{"$f":"IF(Food_Reference!A558=\"\",\"\",Food_Reference!A558)","v":""},{"$f":"IF(Food_Reference!B558=\"\",\"\",Food_Reference!B558)","v":""},{"$f":"IF(Food_Reference!C558=\"\",\"\",Food_Reference!C558)","v":""}]
[{"$f":"IF(Food_Reference!A559=\"\",\"\",Food_Reference!A559)","v":""},{"$f":"IF(Food_Reference!B559=\"\",\"\",Food_Reference!B559)","v":""},{"$f":"IF(Food_Reference!C559=\"\",\"\",Food_Reference!C559)","v":""}]
[{"$f":"IF(Food_Reference!A560=\"\",\"\",Food_Reference!A560)","v":""},{"$f":"IF(Food_Reference!B560=\"\",\"\",Food_Reference!B560)","v":""},{"$f":"IF(Food_Reference!C560=\"\",\"\",Food_Reference!C560)","v":""}]
[{"$f":"IF(Food_Reference!A561=\"\",\"\",Food_Reference!A561)","v":""},{"$f":"IF(Food_Reference!B561=\"\",\"\",Food_Reference!B561)","v":""},{"$f":"IF(Food_Reference!C561=\"\",\"\",Food_Reference!C561)","v":""}]
[{"$f":"IF(Food_Reference!A562=\"\",\"\",Food_Reference!A562)","v":""},{"$f":"IF(Food_Reference!B562=\"\",\"\",Food_Reference!B562)","v":""},{"$f":"IF(Food_Reference!C562=\"\",\"\",Food_Reference!C562)","v":""}]
[{"$f":"IF(Food_Reference!A563=\"\",\"\",Food_Reference!A563)","v":""},{"$f":"IF(Food_Reference!B563=\"\",\"\",Food_Reference!B563)","v":""},{"$f":"IF(Food_Reference!C563=\"\",\"\",Food_Reference!C563)","v":""}]
[{"$f":"IF(Food_Reference!A564=\"\",\"\",Food_Reference!A564)","v":""},{"$f":"IF(Food_Reference!B564=\"\",\"\",Food_Reference!B564)","v":""},{"$f":"IF(Food_Reference!C564=\"\",\"\",Food_Reference!C564)","v":""}]
[{"$f":"IF(Food_Reference!A565=\"\",\"\",Food_Reference!A565)","v":""},{"$f":"IF(Food_Reference!B565=\"\",\"\",Food_Reference!B565)","v":""},{"$f":"IF(Food_Reference!C565=\"\",\"\",Food_Reference!C565)","v":""}]
[{"$f":"IF(Food_Reference!A566=\"\",\"\",Food_Reference!A566)","v":""},{"$f":"IF(Food_Reference!B566=\"\",\"\",Food_Reference!B566)","v":""},{"$f":"IF(Food_Reference!C566=\"\",\"\",Food_Reference!C566)","v":""}]
[{"$f":"IF(Food_Reference!A567=\"\",\"\",Food_Reference!A567)","v":""},{"$f":"IF(Food_Reference!B567=\"\",\"\",Food_Reference!B567)","v":""},{"$f":"IF(Food_Reference!C567=\"\",\"\",Food_Reference!C567)","v":""}]
[{"$f":"IF(Food_Reference!A568=\"\",\"\",Food_Reference!A568)","v":""},{"$f":"IF(Food_Reference!B568=\"\",\"\",Food_Reference!B568)","v":""},{"$f":"IF(Food_Reference!C568=\"\",\"\",Food_Reference!C568)","v":""}]
[{"$f":"IF(Food_Reference!A569=\"\",\"\",Food_Reference!A569)","v":""},{"$f":"IF(Food_Reference!B569=\"\",\"\",Food_Reference!B569)","v":""},{"$f":"IF(Food_Reference!C569=\"\",\"\",Food_Reference!C569)","v":""}]
[{"$f":"IF(Food_Reference!A570=\"\",\"\",Food_Reference!A570)","v":""},{"$f":"IF(Food_Reference!B570=\"\",\"\",Food_Reference!B570)","v":""},{"$f":"IF(Food_Reference!C570=\"\",\"\",Food_Reference!C570)","v":""}]
[{"$f":"IF(Food_Reference!A571=\"\",\"\",Food_Reference!A571)","v":""},{"$f":"IF(Food_Reference!B571=\"\",\"\",Food_Reference!B571)","v":""},{"$f":"IF(Food_Reference!C571=\"\",\"\",Food_Reference!C571)","v":""}]
[{"$f":"IF(Food_Reference!A572=\"\",\"\",Food_Reference!A572)","v":""},{"$f":"IF(Food_Reference!B572=\"\",\"\",Food_Reference!B572)","v":""},{"$f":"IF(Food_Reference!C572=\"\",\"\",Food_Reference!C572)","v":""}]
[{"$f":"IF(Food_Reference!A573=\"\",\"\",Food_Reference!A573)","v":""},{"$f":"IF(Food_Reference!B573=\"\",\"\",Food_Reference!B573)","v":""},{"$f":"IF(Food_Reference!C573=\"\",\"\",Food_Reference!C573)","v":""}]
[{"$f":"IF(Food_Reference!A574=\"\",\"\",Food_Reference!A574)","v":""},{"$f":"IF(Food_Reference!B574=\"\",\"\",Food_Reference!B574)","v":""},{"$f":"IF(Food_Reference!C574=\"\",\"\",Food_Reference!C574)","v":""}]
[{"$f":"IF(Food_Reference!A575=\"\",\"\",Food_Reference!A575)","v":""},{"$f":"IF(Food_Reference!B575=\"\",\"\",Food_Reference!B575)","v":""},{"$f":"IF(Food_Reference!C575=\"\",\"\",Food_Reference!C575)","v":""}]
[{"$f":"IF(Food_Reference!A576=\"\",\"\",Food_Reference!A576)","v":""},{"$f":"IF(Food_Reference!B576=\"\",\"\",Food_Reference!B576)","v":""},{"$f":"IF(Food_Reference!C576=\"\",\"\",Food_Reference!C576)","v":""}]
[{"$f":"IF(Food_Reference!A577=\"\",\"\",Food_Reference!A577)","v":""},{"$f":"IF(Food_Reference!B577=\"\",\"\",Food_Reference!B577)","v":""},{"$f":"IF(Food_Reference!C577=\"\",\"\",Food_Reference!C577)","v":""}]
[{"$f":"IF(Food_Reference!A578=\"\",\"\",Food_Reference!A578)","v":""},{"$f":"IF(Food_Reference!B578=\"\",\"\",Food_Reference!B578)","v":""},{"$f":"IF(Food_Reference!C578=\"\",\"\",Food_Reference!C578)","v":""}]
[{"$f":"IF(Food_Reference!A579=\"\",\"\",Food_Reference!A579)","v":""},{"$f":"IF(Food_Reference!B579=\"\",\"\",Food_Reference!B579)","v":""},{"$f":"IF(Food_Reference!C579=\"\",\"\",Food_Reference!C579)","v":""}]
[{"$f":"IF(Food_Reference!A580=\"\",\"\",Food_Reference!A580)","v":""},{"$f":"IF(Food_Reference!B580=\"\",\"\",Food_Reference!B580)","v":""},{"$f":"IF(Food_Reference!C580=\"\",\"\",Food_Reference!C580)","v":""}]
[{"$f":"IF(Food_Reference!A581=\"\",\"\",Food_Reference!A581)","v":""},{"$f":"IF(Food_Reference!B581=\"\",\"\",Food_Reference!B581)","v":""},{"$f":"IF(Food_Reference!C581=\"\",\"\",Food_Reference!C581)","v":""}]
[{"$f":"IF(Food_Reference!A582=\"\",\"\",Food_Reference!A582)","v":""},{"$f":"IF(Food_Reference!B582=\"\",\"\",Food_Reference!B582)","v":""},{"$f":"IF(Food_Reference!C582=\"\",\"\",Food_Reference!C582)","v":""}]
[{"$f":"IF(Food_Reference!A583=\"\",\"\",Food_Reference!A583)","v":""},{"$f":"IF(Food_Reference!B583=\"\",\"\",Food_Reference!B583)","v":""},{"$f":"IF(Food_Reference!C583=\"\",\"\",Food_Reference!C583)","v":""}]
[{"$f":"IF(Food_Reference!A584=\"\",\"\",Food_Reference!A584)","v":""},{"$f":"IF(Food_Reference!B584=\"\",\"\",Food_Reference!B584)","v":""},{"$f":"IF(Food_Reference!C584=\"\",\"\",Food_Reference!C584)","v":""}]
[{"$f":"IF(Food_Reference!A585=\"\",\"\",Food_Reference!A585)","v":""},{"$f":"IF(Food_Reference!B585=\"\",\"\",Food_Reference!B585)","v":""},{"$f":"IF(Food_Reference!C585=\"\",\"\",Food_Reference!C585)","v":""}]
[{"$f":"IF(Food_Reference!A586=\"\",\"\",Food_Reference!A586)","v":""},{"$f":"IF(Food_Reference!B586=\"\",\"\",Food_Reference!B586)","v":""},{"$f":"IF(Food_Reference!C586=\"\",\"\",Food_Reference!C586)","v":""}]
[{"$f":"IF(Food_Reference!A587=\"\",\"\",Food_Reference!A587)","v":""},{"$f":"IF(Food_Reference!B587=\"\",\"\",Food_Reference!B587)","v":""},{"$f":"IF(Food_Reference!C587=\"\",\"\",Food_Reference!C587)","v":""}]
[{"$f":"IF(Food_Reference!A588=\"\",\"\",Food_Reference!A588)","v":""},{"$f":"IF(Food_Reference!B588=\"\",\"\",Food_Reference!B588)","v":""},{"$f":"IF(Food_Reference!C588=\"\",\"\",Food_Reference!C588)","v":""}]
[{"$f":"IF(Food_Reference!A589=\"\",\"\",Food_Reference!A589)","v":""},{"$f":"IF(Food_Reference!B589=\"\",\"\",Food_Reference!B589)","v":""},{"$f":"IF(Food_Reference!C589=\"\",\"\",Food_Reference!C589)","v":""}]
[{"$f":"IF(Food_Reference!A590=\"\",\"\",Food_Reference!A590)","v":""},{"$f":"IF(Food_Reference!B590=\"\",\"\",Food_Reference!B590)","v":""},{"$f":"IF(Food_Reference!C590=\"\",\"\",Food_Reference!C590)","v":""}]
[{"$f":"IF(Food_Reference!A591=\"\",\"\",Food_Reference!A591)","v":""},{"$f":"IF(Food_Reference!B591=\"\",\"\",Food_Reference!B591)","v":""},{"$f":"IF(Food_Reference!C591=\"\",\"\",Food_Reference!C591)","v":""}]
[{"$f":"IF(Food_Reference!A592=\"\",\"\",Food_Reference!A592)","v":""},{"$f":"IF(Food_Reference!B592=\"\",\"\",Food_Reference!B592)","v":""},{"$f":"IF(Food_Reference!C592=\"\",\"\",Food_Reference!C592)","v":""}]
[{"$f":"IF(Food_Reference!A593=\"\",\"\",Food_Reference!A593)","v":""},{"$f":"IF(Food_Reference!B593=\"\",\"\",Food_Reference!B593)","v":""},{"$f":"IF(Food_Reference!C593=\"\",\"\",Food_Reference!C593)","v":""}]
[{"$f":"IF(Food_Reference!A594=\"\",\"\",Food_Reference!A594)","v":""},{"$f":"IF(Food_Reference!B594=\"\",\"\",Food_Reference!B594)","v":""},{"$f":"IF(Food_Reference!C594=\"\",\"\",Food_Reference!C594)","v":""}]
[{"$f":"IF(Food_Reference!A595=\"\",\"\",Food_Reference!A595)","v":""},{"$f":"IF(Food_Reference!B595=\"\",\"\",Food_Reference!B595)","v":""},{"$f":"IF(Food_Reference!C595=\"\",\"\",Food_Reference!C595)","v":""}]
[{"$f":"IF(Food_Reference!A596=\"\",\"\",Food_Reference!A596)","v":""},{"$f":"IF(Food_Reference!B596=\"\",\"\",Food_Reference!B596)","v":""},{"$f":"IF(Food_Reference!C596=\"\",\"\",Food_Reference!C596)","v":""}]
[{"$f":"IF(Food_Reference!A597=\"\",\"\",Food_Reference!A597)","v":""},{"$f":"IF(Food_Reference!B597=\"\",\"\",Food_Reference!B597)","v":""},{"$f":"IF(Food_Reference!C597=\"\",\"\",Food_Reference!C597)","v":""}]
[{"$f":"IF(Food_Reference!A598=\"\",\"\",Food_Reference!A598)","v":""},{"$f":"IF(Food_Reference!B598=\"\",\"\",Food_Reference!B598)","v":""},{"$f":"IF(Food_Reference!C598=\"\",\"\",Food_Reference!C598)","v":""}]
[{"$f":"IF(Food_Reference!A599=\"\",\"\",Food_Reference!A599)","v":""},{"$f":"IF(Food_Reference!B599=\"\",\"\",Food_Reference!B599)","v":""},{"$f":"IF(Food_Reference!C599=\"\",\"\",Food_Reference!C599)","v":""}]
[{"$f":"IF(Food_Reference!A600=\"\",\"\",Food_Reference!A600)","v":""},{"$f":"IF(Food_Reference!B600=\"\",\"\",Food_Reference!B600)","v":""},{"$f":"IF(Food_Reference!C600=\"\",\"\",Food_Reference!C600)","v":""}]
[{"$f":"IF(Food_Reference!A601=\"\",\"\",Food_Reference!A601)","v":""},{"$f":"IF(Food_Reference!B601=\"\",\"\",Food_Reference!B601)","v":""},{"$f":"IF(Food_Reference!C601=\"\",\"\",Food_Reference!C601)","v":""}]
[{"$f":"IF(Food_Reference!A602=\"\",\"\",Food_Reference!A602)","v":""},{"$f":"IF(Food_Reference!B602=\"\",\"\",Food_Reference!B602)","v":""},{"$f":"IF(Food_Reference!C602=\"\",\"\",Food_Reference!C602)","v":""}]
[{"$f":"IF(Food_Reference!A603=\"\",\"\",Food_Reference!A603)","v":""},{"$f":"IF(Food_Reference!B603=\"\",\"\",Food_Reference!B603)","v":""},{"$f":"IF(Food_Reference!C603=\"\",\"\",Food_Reference!C603)","v":""}]
[{"$f":"IF(Food_Reference!A604=\"\",\"\",Food_Reference!A604)","v":""},{"$f":"IF(Food_Reference!B604=\"\",\"\",Food_Reference!B604)","v":""},{"$f":"IF(Food_Reference!C604=\"\",\"\",Food_Reference!C604)","v":""}]
[{"$f":"IF(Food_Reference!A605=\"\",\"\",Food_Reference!A605)","v":""},{"$f":"IF(Food_Reference!B605=\"\",\"\",Food_Reference!B605)","v":""},{"$f":"IF(Food_Reference!C605=\"\",\"\",Food_Reference!C605)","v":""}]
[{"$f":"IF(Food_Reference!A606=\"\",\"\",Food_Reference!A606)","v":""},{"$f":"IF(Food_Reference!B606=\"\",\"\",Food_Reference!B606)","v":""},{"$f":"IF(Food_Reference!C606=\"\",\"\",Food_Reference!C606)","v":""}]
[{"$f":"IF(Food_Reference!A607=\"\",\"\",Food_Reference!A607)","v":""},{"$f":"IF(Food_Reference!B607=\"\",\"\",Food_Reference!B607)","v":""},{"$f":"IF(Food_Reference!C607=\"\",\"\",Food_Reference!C607)","v":""}]
[{"$f":"IF(Food_Reference!A608=\"\",\"\",Food_Reference!A608)","v":""},{"$f":"IF(Food_Reference!B608=\"\",\"\",Food_Reference!B608)","v":""},{"$f":"IF(Food_Reference!C608=\"\",\"\",Food_Reference!C608)","v":""}]
[{"$f":"IF(Food_Reference!A609=\"\",\"\",Food_Reference!A609)","v":""},{"$f":"IF(Food_Reference!B609=\"\",\"\",Food_Reference!B609)","v":""},{"$f":"IF(Food_Reference!C609=\"\",\"\",Food_Reference!C609)","v":""}]
[{"$f":"IF(Food_Reference!A610=\"\",\"\",Food_Reference!A610)","v":""},{"$f":"IF(Food_Reference!B610=\"\",\"\",Food_Reference!B610)","v":""},{"$f":"IF(Food_Reference!C610=\"\",\"\",Food_Reference!C610)","v":""}]
[{"$f":"IF(Food_Reference!A611=\"\",\"\",Food_Reference!A611)","v":""},{"$f":"IF(Food_Reference!B611=\"\",\"\",Food_Reference!B611)","v":""},{"$f":"IF(Food_Reference!C611=\"\",\"\",Food_Reference!C611)","v":""}]
[{"$f":"IF(Food_Reference!A612=\"\",\"\",Food_Reference!A612)","v":""},{"$f":"IF(Food_Reference!B612=\"\",\"\",Food_Reference!B612)","v":""},{"$f":"IF(Food_Reference!C612=\"\",\"\",Food_Reference!C612)","v":""}]
[{"$f":"IF(Food_Reference!A613=\"\",\"\",Food_Reference!A613)","v":""},{"$f":"IF(Food_Reference!B613=\"\",\"\",Food_Reference!B613)","v":""},{"$f":"IF(Food_Reference!C613=\"\",\"\",Food_Reference!C613)","v":""}]
[{"$f":"IF(Food_Reference!A614=\"\",\"\",Food_Reference!A614)","v":""},{"$f":"IF(Food_Reference!B614=\"\",\"\",Food_Reference!B614)","v":""},{"$f":"IF(Food_Reference!C614=\"\",\"\",Food_Reference!C614)","v":""}]
[{"$f":"IF(Food_Reference!A615=\"\",\"\",Food_Reference!A615)","v":""},{"$f":"IF(Food_Reference!B615=\"\",\"\",Food_Reference!B615)","v":""},{"$f":"IF(Food_Reference!C615=\"\",\"\",Food_Reference!C615)","v":""}]
[{"$f":"IF(Food_Reference!A616=\"\",\"\",Food_Reference!A616)","v":""},{"$f":"IF(Food_Reference!B616=\"\",\"\",Food_Reference!B616)","v":""},{"$f":"IF(Food_Reference!C616=\"\",\"\",Food_Reference!C616)","v":""}]
[{"$f":"IF(Food_Reference!A617=\"\",\"\",Food_Reference!A617)","v":""},{"$f":"IF(Food_Reference!B617=\"\",\"\",Food_Reference!B617)","v":""},{"$f":"IF(Food_Reference!C617=\"\",\"\",Food_Reference!C617)","v":""}]
[{"$f":"IF(Food_Reference!A618=\"\",\"\",Food_Reference!A618)","v":""},{"$f":"IF(Food_Reference!B618=\"\",\"\",Food_Reference!B618)","v":""},{"$f":"IF(Food_Reference!C618=\"\",\"\",Food_Reference!C618)","v":""}]
[{"$f":"IF(Food_Reference!A619=\"\",\"\",Food_Reference!A619)","v":""},{"$f":"IF(Food_Reference!B619=\"\",\"\",Food_Reference!B619)","v":""},{"$f":"IF(Food_Reference!C619=\"\",\"\",Food_Reference!C619)","v":""}]
[{"$f":"IF(Food_Reference!A620=\"\",\"\",Food_Reference!A620)","v":""},{"$f":"IF(Food_Reference!B620=\"\",\"\",Food_Reference!B620)","v":""},{"$f":"IF(Food_Reference!C620=\"\",\"\",Food_Reference!C620)","v":""}]
[{"$f":"IF(Food_Reference!A621=\"\",\"\",Food_Reference!A621)","v":""},{"$f":"IF(Food_Reference!B621=\"\",\"\",Food_Reference!B621)","v":""},{"$f":"IF(Food_Reference!C621=\"\",\"\",Food_Reference!C621)","v":""}]
[{"$f":"IF(Food_Reference!A622=\"\",\"\",Food_Reference!A622)","v":""},{"$f":"IF(Food_Reference!B622=\"\",\"\",Food_Reference!B622)","v":""},{"$f":"IF(Food_Reference!C622=\"\",\"\",Food_Reference!C622)","v":""}]
[{"$f":"IF(Food_Reference!A623=\"\",\"\",Food_Reference!A623)","v":""},{"$f":"IF(Food_Reference!B623=\"\",\"\",Food_Reference!B623)","v":""},{"$f":"IF(Food_Reference!C623=\"\",\"\",Food_Reference!C623)","v":""}]
[{"$f":"IF(Food_Reference!A624=\"\",\"\",Food_Reference!A624)","v":""},{"$f":"IF(Food_Reference!B624=\"\",\"\",Food_Reference!B624)","v":""},{"$f":"IF(Food_Reference!C624=\"\",\"\",Food_Reference!C624)","v":""}]
[{"$f":"IF(Food_Reference!A625=\"\",\"\",Food_Reference!A625)","v":""},{"$f":"IF(Food_Reference!B625=\"\",\"\",Food_Reference!B625)","v":""},{"$f":"IF(Food_Reference!C625=\"\",\"\",Food_Reference!C625)","v":""}]
[{"$f":"IF(Food_Reference!A626=\"\",\"\",Food_Reference!A626)","v":""},{"$f":"IF(Food_Reference!B626=\"\",\"\",Food_Reference!B626)","v":""},{"$f":"IF(Food_Reference!C626=\"\",\"\",Food_Reference!C626)","v":""}]
[{"$f":"IF(Food_Reference!A627=\"\",\"\",Food_Reference!A627)","v":""},{"$f":"IF(Food_Reference!B627=\"\",\"\",Food_Reference!B627)","v":""},{"$f":"IF(Food_Reference!C627=\"\",\"\",Food_Reference!C627)","v":""}]
[{"$f":"IF(Food_Reference!A628=\"\",\"\",Food_Reference!A628)","v":""},{"$f":"IF(Food_Reference!B628=\"\",\"\",Food_Reference!B628)","v":""},{"$f":"IF(Food_Reference!C628=\"\",\"\",Food_Reference!C628)","v":""}]
[{"$f":"IF(Food_Reference!A629=\"\",\"\",Food_Reference!A629)","v":""},{"$f":"IF(Food_Reference!B629=\"\",\"\",Food_Reference!B629)","v":""},{"$f":"IF(Food_Reference!C629=\"\",\"\",Food_Reference!C629)","v":""}]
[{"$f":"IF(Food_Reference!A630=\"\",\"\",Food_Reference!A630)","v":""},{"$f":"IF(Food_Reference!B630=\"\",\"\",Food_Reference!B630)","v":""},{"$f":"IF(Food_Reference!C630=\"\",\"\",Food_Reference!C630)","v":""}]
[{"$f":"IF(Food_Reference!A631=\"\",\"\",Food_Reference!A631)","v":""},{"$f":"IF(Food_Reference!B631=\"\",\"\",Food_Reference!B631)","v":""},{"$f":"IF(Food_Reference!C631=\"\",\"\",Food_Reference!C631)","v":""}]
[{"$f":"IF(Food_Reference!A632=\"\",\"\",Food_Reference!A632)","v":""},{"$f":"IF(Food_Reference!B632=\"\",\"\",Food_Reference!B632)","v":""},{"$f":"IF(Food_Reference!C632=\"\",\"\",Food_Reference!C632)","v":""}]
[{"$f":"IF(Food_Reference!A633=\"\",\"\",Food_Reference!A633)","v":""},{"$f":"IF(Food_Reference!B633=\"\",\"\",Food_Reference!B633)","v":""},{"$f":"IF(Food_Reference!C633=\"\",\"\",Food_Reference!C633)","v":""}]
[{"$f":"IF(Food_Reference!A634=\"\",\"\",Food_Reference!A634)","v":""},{"$f":"IF(Food_Reference!B634=\"\",\"\",Food_Reference!B634)","v":""},{"$f":"IF(Food_Reference!C634=\"\",\"\",Food_Reference!C634)","v":""}]
[{"$f":"IF(Food_Reference!A635=\"\",\"\",Food_Reference!A635)","v":""},{"$f":"IF(Food_Reference!B635=\"\",\"\",Food_Reference!B635)","v":""},{"$f":"IF(Food_Reference!C635=\"\",\"\",Food_Reference!C635)","v":""}]
[{"$f":"IF(Food_Reference!A636=\"\",\"\",Food_Reference!A636)","v":""},{"$f":"IF(Food_Reference!B636=\"\",\"\",Food_Reference!B636)","v":""},{"$f":"IF(Food_Reference!C636=\"\",\"\",Food_Reference!C636)","v":""}]
[{"$f":"IF(Food_Reference!A637=\"\",\"\",Food_Reference!A637)","v":""},{"$f":"IF(Food_Reference!B637=\"\",\"\",Food_Reference!B637)","v":""},{"$f":"IF(Food_Reference!C637=\"\",\"\",Food_Reference!C637)","v":""}]
[{"$f":"IF(Food_Reference!A638=\"\",\"\",Food_Reference!A638)","v":""},{"$f":"IF(Food_Reference!B638=\"\",\"\",Food_Reference!B638)","v":""},{"$f":"IF(Food_Reference!C638=\"\",\"\",Food_Reference!C638)","v":""}]
[{"$f":"IF(Food_Reference!A639=\"\",\"\",Food_Reference!A639)","v":""},{"$f":"IF(Food_Reference!B639=\"\",\"\",Food_Reference!B639)","v":""},{"$f":"IF(Food_Reference!C639=\"\",\"\",Food_Reference!C639)","v":""}]
[{"$f":"IF(Food_Reference!A640=\"\",\"\",Food_Reference!A640)","v":""},{"$f":"IF(Food_Reference!B640=\"\",\"\",Food_Reference!B640)","v":""},{"$f":"IF(Food_Reference!C640=\"\",\"\",Food_Reference!C640)","v":""}]
[{"$f":"IF(Food_Reference!A641=\"\",\"\",Food_Reference!A641)","v":""},{"$f":"IF(Food_Reference!B641=\"\",\"\",Food_Reference!B641)","v":""},{"$f":"IF(Food_Reference!C641=\"\",\"\",Food_Reference!C641)","v":""}]
[{"$f":"IF(Food_Reference!A642=\"\",\"\",Food_Reference!A642)","v":""},{"$f":"IF(Food_Reference!B642=\"\",\"\",Food_Reference!B642)","v":""},{"$f":"IF(Food_Reference!C642=\"\",\"\",Food_Reference!C642)","v":""}]
[{"$f":"IF(Food_Reference!A643=\"\",\"\",Food_Reference!A643)","v":""},{"$f":"IF(Food_Reference!B643=\"\",\"\",Food_Reference!B643)","v":""},{"$f":"IF(Food_Reference!C643=\"\",\"\",Food_Reference!C643)","v":""}]
[{"$f":"IF(Food_Reference!A644=\"\",\"\",Food_Reference!A644)","v":""},{"$f":"IF(Food_Reference!B644=\"\",\"\",Food_Reference!B644)","v":""},{"$f":"IF(Food_Reference!C644=\"\",\"\",Food_Reference!C644)","v":""}]
[{"$f":"IF(Food_Reference!A645=\"\",\"\",Food_Reference!A645)","v":""},{"$f":"IF(Food_Reference!B645=\"\",\"\",Food_Reference!B645)","v":""},{"$f":"IF(Food_Reference!C645=\"\",\"\",Food_Reference!C645)","v":""}]
[{"$f":"IF(Food_Reference!A646=\"\",\"\",Food_Reference!A646)","v":""},{"$f":"IF(Food_Reference!B646=\"\",\"\",Food_Reference!B646)","v":""},{"$f":"IF(Food_Reference!C646=\"\",\"\",Food_Reference!C646)","v":""}]
[{"$f":"IF(Food_Reference!A647=\"\",\"\",Food_Reference!A647)","v":""},{"$f":"IF(Food_Reference!B647=\"\",\"\",Food_Reference!B647)","v":""},{"$f":"IF(Food_Reference!C647=\"\",\"\",Food_Reference!C647)","v":""}]
[{"$f":"IF(Food_Reference!A648=\"\",\"\",Food_Reference!A648)","v":""},{"$f":"IF(Food_Reference!B648=\"\",\"\",Food_Reference!B648)","v":""},{"$f":"IF(Food_Reference!C648=\"\",\"\",Food_Reference!C648)","v":""}]
[{"$f":"IF(Food_Reference!A649=\"\",\"\",Food_Reference!A649)","v":""},{"$f":"IF(Food_Reference!B649=\"\",\"\",Food_Reference!B649)","v":""},{"$f":"IF(Food_Reference!C649=\"\",\"\",Food_Reference!C649)","v":""}]
[{"$f":"IF(Food_Reference!A650=\"\",\"\",Food_Reference!A650)","v":""},{"$f":"IF(Food_Reference!B650=\"\",\"\",Food_Reference!B650)","v":""},{"$f":"IF(Food_Reference!C650=\"\",\"\",Food_Reference!C650)","v":""}]
[{"$f":"IF(Food_Reference!A651=\"\",\"\",Food_Reference!A651)","v":""},{"$f":"IF(Food_Reference!B651=\"\",\"\",Food_Reference!B651)","v":""},{"$f":"IF(Food_Reference!C651=\"\",\"\",Food_Reference!C651)","v":""}]
[{"$f":"IF(Food_Reference!A652=\"\",\"\",Food_Reference!A652)","v":""},{"$f":"IF(Food_Reference!B652=\"\",\"\",Food_Reference!B652)","v":""},{"$f":"IF(Food_Reference!C652=\"\",\"\",Food_Reference!C652)","v":""}]
[{"$f":"IF(Food_Reference!A653=\"\",\"\",Food_Reference!A653)","v":""},{"$f":"IF(Food_Reference!B653=\"\",\"\",Food_Reference!B653)","v":""},{"$f":"IF(Food_Reference!C653=\"\",\"\",Food_Reference!C653)","v":""}]
[{"$f":"IF(Food_Reference!A654=\"\",\"\",Food_Reference!A654)","v":""},{"$f":"IF(Food_Reference!B654=\"\",\"\",Food_Reference!B654)","v":""},{"$f":"IF(Food_Reference!C654=\"\",\"\",Food_Reference!C654)","v":""}]
[{"$f":"IF(Food_Reference!A655=\"\",\"\",Food_Reference!A655)","v":""},{"$f":"IF(Food_Reference!B655=\"\",\"\",Food_Reference!B655)","v":""},{"$f":"IF(Food_Reference!C655=\"\",\"\",Food_Reference!C655)","v":""}]
[{"$f":"IF(Food_Reference!A656=\"\",\"\",Food_Reference!A656)","v":""},{"$f":"IF(Food_Reference!B656=\"\",\"\",Food_Reference!B656)","v":""},{"$f":"IF(Food_Reference!C656=\"\",\"\",Food_Reference!C656)","v":""}]
[{"$f":"IF(Food_Reference!A657=\"\",\"\",Food_Reference!A657)","v":""},{"$f":"IF(Food_Reference!B657=\"\",\"\",Food_Reference!B657)","v":""},{"$f":"IF(Food_Reference!C657=\"\",\"\",Food_Reference!C657)","v":""}]
[{"$f":"IF(Food_Reference!A658=\"\",\"\",Food_Reference!A658)","v":""},{"$f":"IF(Food_Reference!B658=\"\",\"\",Food_Reference!B658)","v":""},{"$f":"IF(Food_Reference!C658=\"\",\"\",Food_Reference!C658)","v":""}]
[{"$f":"IF(Food_Reference!A659=\"\",\"\",Food_Reference!A659)","v":""},{"$f":"IF(Food_Reference!B659=\"\",\"\",Food_Reference!B659)","v":""},{"$f":"IF(Food_Reference!C659=\"\",\"\",Food_Reference!C659)","v":""}]
[{"$f":"IF(Food_Reference!A660=\"\",\"\",Food_Reference!A660)","v":""},{"$f":"IF(Food_Reference!B660=\"\",\"\",Food_Reference!B660)","v":""},{"$f":"IF(Food_Reference!C660=\"\",\"\",Food_Reference!C660)","v":""}]
[{"$f":"IF(Food_Reference!A661=\"\",\"\",Food_Reference!A661)","v":""},{"$f":"IF(Food_Reference!B661=\"\",\"\",Food_Reference!B661)","v":""},{"$f":"IF(Food_Reference!C661=\"\",\"\",Food_Reference!C661)","v":""}]
[{"$f":"IF(Food_Reference!A662=\"\",\"\",Food_Reference!A662)","v":""},{"$f":"IF(Food_Reference!B662=\"\",\"\",Food_Reference!B662)","v":""},{"$f":"IF(Food_Reference!C662=\"\",\"\",Food_Reference!C662)","v":""}]
[{"$f":"IF(Food_Reference!A663=\"\",\"\",Food_Reference!A663)","v":""},{"$f":"IF(Food_Reference!B663=\"\",\"\",Food_Reference!B663)","v":""},{"$f":"IF(Food_Reference!C663=\"\",\"\",Food_Reference!C663)","v":""}]
[{"$f":"IF(Food_Reference!A664=\"\",\"\",Food_Reference!A664)","v":""},{"$f":"IF(Food_Reference!B664=\"\",\"\",Food_Reference!B664)","v":""},{"$f":"IF(Food_Reference!C664=\"\",\"\",Food_Reference!C664)","v":""}]
[{"$f":"IF(Food_Reference!A665=\"\",\"\",Food_Reference!A665)","v":""},{"$f":"IF(Food_Reference!B665=\"\",\"\",Food_Reference!B665)","v":""},{"$f":"IF(Food_Reference!C665=\"\",\"\",Food_Reference!C665)","v":""}]
[{"$f":"IF(Food_Reference!A666=\"\",\"\",Food_Reference!A666)","v":""},{"$f":"IF(Food_Reference!B666=\"\",\"\",Food_Reference!B666)","v":""},{"$f":"IF(Food_Reference!C666=\"\",\"\",Food_Reference!C666)","v":""}]
[{"$f":"IF(Food_Reference!A667=\"\",\"\",Food_Reference!A667)","v":""},{"$f":"IF(Food_Reference!B667=\"\",\"\",Food_Reference!B667)","v":""},{"$f":"IF(Food_Reference!C667=\"\",\"\",Food_Reference!C667)","v":""}]
[{"$f":"IF(Food_Reference!A668=\"\",\"\",Food_Reference!A668)","v":""},{"$f":"IF(Food_Reference!B668=\"\",\"\",Food_Reference!B668)","v":""},{"$f":"IF(Food_Reference!C668=\"\",\"\",Food_Reference!C668)","v":""}]
[{"$f":"IF(Food_Reference!A669=\"\",\"\",Food_Reference!A669)","v":""},{"$f":"IF(Food_Reference!B669=\"\",\"\",Food_Reference!B669)","v":""},{"$f":"IF(Food_Reference!C669=\"\",\"\",Food_Reference!C669)","v":""}]
[{"$f":"IF(Food_Reference!A670=\"\",\"\",Food_Reference!A670)","v":""},{"$f":"IF(Food_Reference!B670=\"\",\"\",Food_Reference!B670)","v":""},{"$f":"IF(Food_Reference!C670=\"\",\"\",Food_Reference!C670)","v":""}]
[{"$f":"IF(Food_Reference!A671=\"\",\"\",Food_Reference!A671)","v":""},{"$f":"IF(Food_Reference!B671=\"\",\"\",Food_Reference!B671)","v":""},{"$f":"IF(Food_Reference!C671=\"\",\"\",Food_Reference!C671)","v":""}]
[{"$f":"IF(Food_Reference!A672=\"\",\"\",Food_Reference!A672)","v":""},{"$f":"IF(Food_Reference!B672=\"\",\"\",Food_Reference!B672)","v":""},{"$f":"IF(Food_Reference!C672=\"\",\"\",Food_Reference!C672)","v":""}]
[{"$f":"IF(Food_Reference!A673=\"\",\"\",Food_Reference!A673)","v":""},{"$f":"IF(Food_Reference!B673=\"\",\"\",Food_Reference!B673)","v":""},{"$f":"IF(Food_Reference!C673=\"\",\"\",Food_Reference!C673)","v":""}]
[{"$f":"IF(Food_Reference!A674=\"\",\"\",Food_Reference!A674)","v":""},{"$f":"IF(Food_Reference!B674=\"\",\"\",Food_Reference!B674)","v":""},{"$f":"IF(Food_Reference!C674=\"\",\"\",Food_Reference!C674)","v":""}]
[{"$f":"IF(Food_Reference!A675=\"\",\"\",Food_Reference!A675)","v":""},{"$f":"IF(Food_Reference!B675=\"\",\"\",Food_Reference!B675)","v":""},{"$f":"IF(Food_Reference!C675=\"\",\"\",Food_Reference!C675)","v":""}]
[{"$f":"IF(Food_Reference!A676=\"\",\"\",Food_Reference!A676)","v":""},{"$f":"IF(Food_Reference!B676=\"\",\"\",Food_Reference!B676)","v":""},{"$f":"IF(Food_Reference!C676=\"\",\"\",Food_Reference!C676)","v":""}]
[{"$f":"IF(Food_Reference!A677=\"\",\"\",Food_Reference!A677)","v":""},{"$f":"IF(Food_Reference!B677=\"\",\"\",Food_Reference!B677)","v":""},{"$f":"IF(Food_Reference!C677=\"\",\"\",Food_Reference!C677)","v":""}]
[{"$f":"IF(Food_Reference!A678=\"\",\"\",Food_Reference!A678)","v":""},{"$f":"IF(Food_Reference!B678=\"\",\"\",Food_Reference!B678)","v":""},{"$f":"IF(Food_Reference!C678=\"\",\"\",Food_Reference!C678)","v":""}]
[{"$f":"IF(Food_Reference!A679=\"\",\"\",Food_Reference!A679)","v":""},{"$f":"IF(Food_Reference!B679=\"\",\"\",Food_Reference!B679)","v":""},{"$f":"IF(Food_Reference!C679=\"\",\"\",Food_Reference!C679)","v":""}]
[{"$f":"IF(Food_Reference!A680=\"\",\"\",Food_Reference!A680)","v":""},{"$f":"IF(Food_Reference!B680=\"\",\"\",Food_Reference!B680)","v":""},{"$f":"IF(Food_Reference!C680=\"\",\"\",Food_Reference!C680)","v":""}]
[{"$f":"IF(Food_Reference!A681=\"\",\"\",Food_Reference!A681)","v":""},{"$f":"IF(Food_Reference!B681=\"\",\"\",Food_Reference!B681)","v":""},{"$f":"IF(Food_Reference!C681=\"\",\"\",Food_Reference!C681)","v":""}]
[{"$f":"IF(Food_Reference!A682=\"\",\"\",Food_Reference!A682)","v":""},{"$f":"IF(Food_Reference!B682=\"\",\"\",Food_Reference!B682)","v":""},{"$f":"IF(Food_Reference!C682=\"\",\"\",Food_Reference!C682)","v":""}]
[{"$f":"IF(Food_Reference!A683=\"\",\"\",Food_Reference!A683)","v":""},{"$f":"IF(Food_Reference!B683=\"\",\"\",Food_Reference!B683)","v":""},{"$f":"IF(Food_Reference!C683=\"\",\"\",Food_Reference!C683)","v":""}]
[{"$f":"IF(Food_Reference!A684=\"\",\"\",Food_Reference!A684)","v":""},{"$f":"IF(Food_Reference!B684=\"\",\"\",Food_Reference!B684)","v":""},{"$f":"IF(Food_Reference!C684=\"\",\"\",Food_Reference!C684)","v":""}]
[{"$f":"IF(Food_Reference!A685=\"\",\"\",Food_Reference!A685)","v":""},{"$f":"IF(Food_Reference!B685=\"\",\"\",Food_Reference!B685)","v":""},{"$f":"IF(Food_Reference!C685=\"\",\"\",Food_Reference!C685)","v":""}]
[{"$f":"IF(Food_Reference!A686=\"\",\"\",Food_Reference!A686)","v":""},{"$f":"IF(Food_Reference!B686=\"\",\"\",Food_Reference!B686)","v":""},{"$f":"IF(Food_Reference!C686=\"\",\"\",Food_Reference!C686)","v":""}]
[{"$f":"IF(Food_Reference!A687=\"\",\"\",Food_Reference!A687)","v":""},{"$f":"IF(Food_Reference!B687=\"\",\"\",Food_Reference!B687)","v":""},{"$f":"IF(Food_Reference!C687=\"\",\"\",Food_Reference!C687)","v":""}]
[{"$f":"IF(Food_Reference!A688=\"\",\"\",Food_Reference!A688)","v":""},{"$f":"IF(Food_Reference!B688=\"\",\"\",Food_Reference!B688)","v":""},{"$f":"IF(Food_Reference!C688=\"\",\"\",Food_Reference!C688)","v":""}]
[{"$f":"IF(Food_Reference!A689=\"\",\"\",Food_Reference!A689)","v":""},{"$f":"IF(Food_Reference!B689=\"\",\"\",Food_Reference!B689)","v":""},{"$f":"IF(Food_Reference!C689=\"\",\"\",Food_Reference!C689)","v":""}]
[{"$f":"IF(Food_Reference!A690=\"\",\"\",Food_Reference!A690)","v":""},{"$f":"IF(Food_Reference!B690=\"\",\"\",Food_Reference!B690)","v":""},{"$f":"IF(Food_Reference!C690=\"\",\"\",Food_Reference!C690)","v":""}]
[{"$f":"IF(Food_Reference!A691=\"\",\"\",Food_Reference!A691)","v":""},{"$f":"IF(Food_Reference!B691=\"\",\"\",Food_Reference!B691)","v":""},{"$f":"IF(Food_Reference!C691=\"\",\"\",Food_Reference!C691)","v":""}]
[{"$f":"IF(Food_Reference!A692=\"\",\"\",Food_Reference!A692)","v":""},{"$f":"IF(Food_Reference!B692=\"\",\"\",Food_Reference!B692)","v":""},{"$f":"IF(Food_Reference!C692=\"\",\"\",Food_Reference!C692)","v":""}]
[{"$f":"IF(Food_Reference!A693=\"\",\"\",Food_Reference!A693)","v":""},{"$f":"IF(Food_Reference!B693=\"\",\"\",Food_Reference!B693)","v":""},{"$f":"IF(Food_Reference!C693=\"\",\"\",Food_Reference!C693)","v":""}]
[{"$f":"IF(Food_Reference!A694=\"\",\"\",Food_Reference!A694)","v":""},{"$f":"IF(Food_Reference!B694=\"\",\"\",Food_Reference!B694)","v":""},{"$f":"IF(Food_Reference!C694=\"\",\"\",Food_Reference!C694)","v":""}]
[{"$f":"IF(Food_Reference!A695=\"\",\"\",Food_Reference!A695)","v":""},{"$f":"IF(Food_Reference!B695=\"\",\"\",Food_Reference!B695)","v":""},{"$f":"IF(Food_Reference!C695=\"\",\"\",Food_Reference!C695)","v":""}]
[{"$f":"IF(Food_Reference!A696=\"\",\"\",Food_Reference!A696)","v":""},{"$f":"IF(Food_Reference!B696=\"\",\"\",Food_Reference!B696)","v":""},{"$f":"IF(Food_Reference!C696=\"\",\"\",Food_Reference!C696)","v":""}]
[{"$f":"IF(Food_Reference!A697=\"\",\"\",Food_Reference!A697)","v":""},{"$f":"IF(Food_Reference!B697=\"\",\"\",Food_Reference!B697)","v":""},{"$f":"IF(Food_Reference!C697=\"\",\"\",Food_Reference!C697)","v":""}]
[{"$f":"IF(Food_Reference!A698=\"\",\"\",Food_Reference!A698)","v":""},{"$f":"IF(Food_Reference!B698=\"\",\"\",Food_Reference!B698)","v":""},{"$f":"IF(Food_Reference!C698=\"\",\"\",Food_Reference!C698)","v":""}]
[{"$f":"IF(Food_Reference!A699=\"\",\"\",Food_Reference!A699)","v":""},{"$f":"IF(Food_Reference!B699=\"\",\"\",Food_Reference!B699)","v":""},{"$f":"IF(Food_Reference!C699=\"\",\"\",Food_Reference!C699)","v":""}]
[{"$f":"IF(Food_Reference!A700=\"\",\"\",Food_Reference!A700)","v":""},{"$f":"IF(Food_Reference!B700=\"\",\"\",Food_Reference!B700)","v":""},{"$f":"IF(Food_Reference!C700=\"\",\"\",Food_Reference!C700)","v":""}]
[{"$f":"IF(Food_Reference!A701=\"\",\"\",Food_Reference!A701)","v":""},{"$f":"IF(Food_Reference!B701=\"\",\"\",Food_Reference!B701)","v":""},{"$f":"IF(Food_Reference!C701=\"\",\"\",Food_Reference!C701)","v":""}]
[{"$f":"IF(Food_Reference!A702=\"\",\"\",Food_Reference!A702)","v":""},{"$f":"IF(Food_Reference!B702=\"\",\"\",Food_Reference!B702)","v":""},{"$f":"IF(Food_Reference!C702=\"\",\"\",Food_Reference!C702)","v":""}]
[{"$f":"IF(Food_Reference!A703=\"\",\"\",Food_Reference!A703)","v":""},{"$f":"IF(Food_Reference!B703=\"\",\"\",Food_Reference!B703)","v":""},{"$f":"IF(Food_Reference!C703=\"\",\"\",Food_Reference!C703)","v":""}]
[{"$f":"IF(Food_Reference!A704=\"\",\"\",Food_Reference!A704)","v":""},{"$f":"IF(Food_Reference!B704=\"\",\"\",Food_Reference!B704)","v":""},{"$f":"IF(Food_Reference!C704=\"\",\"\",Food_Reference!C704)","v":""}]
[{"$f":"IF(Food_Reference!A705=\"\",\"\",Food_Reference!A705)","v":""},{"$f":"IF(Food_Reference!B705=\"\",\"\",Food_Reference!B705)","v":""},{"$f":"IF(Food_Reference!C705=\"\",\"\",Food_Reference!C705)","v":""}]
[{"$f":"IF(Food_Reference!A706=\"\",\"\",Food_Reference!A706)","v":""},{"$f":"IF(Food_Reference!B706=\"\",\"\",Food_Reference!B706)","v":""},{"$f":"IF(Food_Reference!C706=\"\",\"\",Food_Reference!C706)","v":""}]
[{"$f":"IF(Food_Reference!A707=\"\",\"\",Food_Reference!A707)","v":""},{"$f":"IF(Food_Reference!B707=\"\",\"\",Food_Reference!B707)","v":""},{"$f":"IF(Food_Reference!C707=\"\",\"\",Food_Reference!C707)","v":""}]
[{"$f":"IF(Food_Reference!A708=\"\",\"\",Food_Reference!A708)","v":""},{"$f":"IF(Food_Reference!B708=\"\",\"\",Food_Reference!B708)","v":""},{"$f":"IF(Food_Reference!C708=\"\",\"\",Food_Reference!C708)","v":""}]
[{"$f":"IF(Food_Reference!A709=\"\",\"\",Food_Reference!A709)","v":""},{"$f":"IF(Food_Reference!B709=\"\",\"\",Food_Reference!B709)","v":""},{"$f":"IF(Food_Reference!C709=\"\",\"\",Food_Reference!C709)","v":""}]
[{"$f":"IF(Food_Reference!A710=\"\",\"\",Food_Reference!A710)","v":""},{"$f":"IF(Food_Reference!B710=\"\",\"\",Food_Reference!B710)","v":""},{"$f":"IF(Food_Reference!C710=\"\",\"\",Food_Reference!C710)","v":""}]
[{"$f":"IF(Food_Reference!A711=\"\",\"\",Food_Reference!A711)","v":""},{"$f":"IF(Food_Reference!B711=\"\",\"\",Food_Reference!B711)","v":""},{"$f":"IF(Food_Reference!C711=\"\",\"\",Food_Reference!C711)","v":""}]
[{"$f":"IF(Food_Reference!A712=\"\",\"\",Food_Reference!A712)","v":""},{"$f":"IF(Food_Reference!B712=\"\",\"\",Food_Reference!B712)","v":""},{"$f":"IF(Food_Reference!C712=\"\",\"\",Food_Reference!C712)","v":""}]
[{"$f":"IF(Food_Reference!A713=\"\",\"\",Food_Reference!A713)","v":""},{"$f":"IF(Food_Reference!B713=\"\",\"\",Food_Reference!B713)","v":""},{"$f":"IF(Food_Reference!C713=\"\",\"\",Food_Reference!C713)","v":""}]
[{"$f":"IF(Food_Reference!A714=\"\",\"\",Food_Reference!A714)","v":""},{"$f":"IF(Food_Reference!B714=\"\",\"\",Food_Reference!B714)","v":""},{"$f":"IF(Food_Reference!C714=\"\",\"\",Food_Reference!C714)","v":""}]
[{"$f":"IF(Food_Reference!A715=\"\",\"\",Food_Reference!A715)","v":""},{"$f":"IF(Food_Reference!B715=\"\",\"\",Food_Reference!B715)","v":""},{"$f":"IF(Food_Reference!C715=\"\",\"\",Food_Reference!C715)","v":""}]
[{"$f":"IF(Food_Reference!A716=\"\",\"\",Food_Reference!A716)","v":""},{"$f":"IF(Food_Reference!B716=\"\",\"\",Food_Reference!B716)","v":""},{"$f":"IF(Food_Reference!C716=\"\",\"\",Food_Reference!C716)","v":""}]
[{"$f":"IF(Food_Reference!A717=\"\",\"\",Food_Reference!A717)","v":""},{"$f":"IF(Food_Reference!B717=\"\",\"\",Food_Reference!B717)","v":""},{"$f":"IF(Food_Reference!C717=\"\",\"\",Food_Reference!C717)","v":""}]
[{"$f":"IF(Food_Reference!A718=\"\",\"\",Food_Reference!A718)","v":""},{"$f":"IF(Food_Reference!B718=\"\",\"\",Food_Reference!B718)","v":""},{"$f":"IF(Food_Reference!C718=\"\",\"\",Food_Reference!C718)","v":""}]
[{"$f":"IF(Food_Reference!A719=\"\",\"\",Food_Reference!A719)","v":""},{"$f":"IF(Food_Reference!B719=\"\",\"\",Food_Reference!B719)","v":""},{"$f":"IF(Food_Reference!C719=\"\",\"\",Food_Reference!C719)","v":""}]
[{"$f":"IF(Food_Reference!A720=\"\",\"\",Food_Reference!A720)","v":""},{"$f":"IF(Food_Reference!B720=\"\",\"\",Food_Reference!B720)","v":""},{"$f":"IF(Food_Reference!C720=\"\",\"\",Food_Reference!C720)","v":""}]
[{"$f":"IF(Food_Reference!A721=\"\",\"\",Food_Reference!A721)","v":""},{"$f":"IF(Food_Reference!B721=\"\",\"\",Food_Reference!B721)","v":""},{"$f":"IF(Food_Reference!C721=\"\",\"\",Food_Reference!C721)","v":""}]
[{"$f":"IF(Food_Reference!A722=\"\",\"\",Food_Reference!A722)","v":""},{"$f":"IF(Food_Reference!B722=\"\",\"\",Food_Reference!B722)","v":""},{"$f":"IF(Food_Reference!C722=\"\",\"\",Food_Reference!C722)","v":""}]
[{"$f":"IF(Food_Reference!A723=\"\",\"\",Food_Reference!A723)","v":""},{"$f":"IF(Food_Reference!B723=\"\",\"\",Food_Reference!B723)","v":""},{"$f":"IF(Food_Reference!C723=\"\",\"\",Food_Reference!C723)","v":""}]
[{"$f":"IF(Food_Reference!A724=\"\",\"\",Food_Reference!A724)","v":""},{"$f":"IF(Food_Reference!B724=\"\",\"\",Food_Reference!B724)","v":""},{"$f":"IF(Food_Reference!C724=\"\",\"\",Food_Reference!C724)","v":""}]
[{"$f":"IF(Food_Reference!A725=\"\",\"\",Food_Reference!A725)","v":""},{"$f":"IF(Food_Reference!B725=\"\",\"\",Food_Reference!B725)","v":""},{"$f":"IF(Food_Reference!C725=\"\",\"\",Food_Reference!C725)","v":""}]
[{"$f":"IF(Food_Reference!A726=\"\",\"\",Food_Reference!A726)","v":""},{"$f":"IF(Food_Reference!B726=\"\",\"\",Food_Reference!B726)","v":""},{"$f":"IF(Food_Reference!C726=\"\",\"\",Food_Reference!C726)","v":""}]
[{"$f":"IF(Food_Reference!A727=\"\",\"\",Food_Reference!A727)","v":""},{"$f":"IF(Food_Reference!B727=\"\",\"\",Food_Reference!B727)","v":""},{"$f":"IF(Food_Reference!C727=\"\",\"\",Food_Reference!C727)","v":""}]
[{"$f":"IF(Food_Reference!A728=\"\",\"\",Food_Reference!A728)","v":""},{"$f":"IF(Food_Reference!B728=\"\",\"\",Food_Reference!B728)","v":""},{"$f":"IF(Food_Reference!C728=\"\",\"\",Food_Reference!C728)","v":""}]
[{"$f":"IF(Food_Reference!A729=\"\",\"\",Food_Reference!A729)","v":""},{"$f":"IF(Food_Reference!B729=\"\",\"\",Food_Reference!B729)","v":""},{"$f":"IF(Food_Reference!C729=\"\",\"\",Food_Reference!C729)","v":""}]
[{"$f":"IF(Food_Reference!A730=\"\",\"\",Food_Reference!A730)","v":""},{"$f":"IF(Food_Reference!B730=\"\",\"\",Food_Reference!B730)","v":""},{"$f":"IF(Food_Reference!C730=\"\",\"\",Food_Reference!C730)","v":""}]
[{"$f":"IF(Food_Reference!A731=\"\",\"\",Food_Reference!A731)","v":""},{"$f":"IF(Food_Reference!B731=\"\",\"\",Food_Reference!B731)","v":""},{"$f":"IF(Food_Reference!C731=\"\",\"\",Food_Reference!C731)","v":""}]
[{"$f":"IF(Food_Reference!A732=\"\",\"\",Food_Reference!A732)","v":""},{"$f":"IF(Food_Reference!B732=\"\",\"\",Food_Reference!B732)","v":""},{"$f":"IF(Food_Reference!C732=\"\",\"\",Food_Reference!C732)","v":""}]
[{"$f":"IF(Food_Reference!A733=\"\",\"\",Food_Reference!A733)","v":""},{"$f":"IF(Food_Reference!B733=\"\",\"\",Food_Reference!B733)","v":""},{"$f":"IF(Food_Reference!C733=\"\",\"\",Food_Reference!C733)","v":""}]
[{"$f":"IF(Food_Reference!A734=\"\",\"\",Food_Reference!A734)","v":""},{"$f":"IF(Food_Reference!B734=\"\",\"\",Food_Reference!B734)","v":""},{"$f":"IF(Food_Reference!C734=\"\",\"\",Food_Reference!C734)","v":""}]
[{"$f":"IF(Food_Reference!A735=\"\",\"\",Food_Reference!A735)","v":""},{"$f":"IF(Food_Reference!B735=\"\",\"\",Food_Reference!B735)","v":""},{"$f":"IF(Food_Reference!C735=\"\",\"\",Food_Reference!C735)","v":""}]
[{"$f":"IF(Food_Reference!A736=\"\",\"\",Food_Reference!A736)","v":""},{"$f":"IF(Food_Reference!B736=\"\",\"\",Food_Reference!B736)","v":""},{"$f":"IF(Food_Reference!C736=\"\",\"\",Food_Reference!C736)","v":""}]
[{"$f":"IF(Food_Reference!A737=\"\",\"\",Food_Reference!A737)","v":""},{"$f":"IF(Food_Reference!B737=\"\",\"\",Food_Reference!B737)","v":""},{"$f":"IF(Food_Reference!C737=\"\",\"\",Food_Reference!C737)","v":""}]
[{"$f":"IF(Food_Reference!A738=\"\",\"\",Food_Reference!A738)","v":""},{"$f":"IF(Food_Reference!B738=\"\",\"\",Food_Reference!B738)","v":""},{"$f":"IF(Food_Reference!C738=\"\",\"\",Food_Reference!C738)","v":""}]
[{"$f":"IF(Food_Reference!A739=\"\",\"\",Food_Reference!A739)","v":""},{"$f":"IF(Food_Reference!B739=\"\",\"\",Food_Reference!B739)","v":""},{"$f":"IF(Food_Reference!C739=\"\",\"\",Food_Reference!C739)","v":""}]
[{"$f":"IF(Food_Reference!A740=\"\",\"\",Food_Reference!A740)","v":""},{"$f":"IF(Food_Reference!B740=\"\",\"\",Food_Reference!B740)","v":""},{"$f":"IF(Food_Reference!C740=\"\",\"\",Food_Reference!C740)","v":""}]
[{"$f":"IF(Food_Reference!A741=\"\",\"\",Food_Reference!A741)","v":""},{"$f":"IF(Food_Reference!B741=\"\",\"\",Food_Reference!B741)","v":""},{"$f":"IF(Food_Reference!C741=\"\",\"\",Food_Reference!C741)","v":""}]
[{"$f":"IF(Food_Reference!A742=\"\",\"\",Food_Reference!A742)","v":""},{"$f":"IF(Food_Reference!B742=\"\",\"\",Food_Reference!B742)","v":""},{"$f":"IF(Food_Reference!C742=\"\",\"\",Food_Reference!C742)","v":""}]
[{"$f":"IF(Food_Reference!A743=\"\",\"\",Food_Reference!A743)","v":""},{"$f":"IF(Food_Reference!B743=\"\",\"\",Food_Reference!B743)","v":""},{"$f":"IF(Food_Reference!C743=\"\",\"\",Food_Reference!C743)","v":""}]
[{"$f":"IF(Food_Reference!A744=\"\",\"\",Food_Reference!A744)","v":""},{"$f":"IF(Food_Reference!B744=\"\",\"\",Food_Reference!B744)","v":""},{"$f":"IF(Food_Reference!C744=\"\",\"\",Food_Reference!C744)","v":""}]
[{"$f":"IF(Food_Reference!A745=\"\",\"\",Food_Reference!A745)","v":""},{"$f":"IF(Food_Reference!B745=\"\",\"\",Food_Reference!B745)","v":""},{"$f":"IF(Food_Reference!C745=\"\",\"\",Food_Reference!C745)","v":""}]
[{"$f":"IF(Food_Reference!A746=\"\",\"\",Food_Reference!A746)","v":""},{"$f":"IF(Food_Reference!B746=\"\",\"\",Food_Reference!B746)","v":""},{"$f":"IF(Food_Reference!C746=\"\",\"\",Food_Reference!C746)","v":""}]
[{"$f":"IF(Food_Reference!A747=\"\",\"\",Food_Reference!A747)","v":""},{"$f":"IF(Food_Reference!B747=\"\",\"\",Food_Reference!B747)","v":""},{"$f":"IF(Food_Reference!C747=\"\",\"\",Food_Reference!C747)","v":""}]
[{"$f":"IF(Food_Reference!A748=\"\",\"\",Food_Reference!A748)","v":""},{"$f":"IF(Food_Reference!B748=\"\",\"\",Food_Reference!B748)","v":""},{"$f":"IF(Food_Reference!C748=\"\",\"\",Food_Reference!C748)","v":""}]
[{"$f":"IF(Food_Reference!A749=\"\",\"\",Food_Reference!A749)","v":""},{"$f":"IF(Food_Reference!B749=\"\",\"\",Food_Reference!B749)","v":""},{"$f":"IF(Food_Reference!C749=\"\",\"\",Food_Reference!C749)","v":""}]
[{"$f":"IF(Food_Reference!A750=\"\",\"\",Food_Reference!A750)","v":""},{"$f":"IF(Food_Reference!B750=\"\",\"\",Food_Reference!B750)","v":""},{"$f":"IF(Food_Reference!C750=\"\",\"\",Food_Reference!C750)","v":""}]
[{"$f":"IF(Food_Reference!A751=\"\",\"\",Food_Reference!A751)","v":""},{"$f":"IF(Food_Reference!B751=\"\",\"\",Food_Reference!B751)","v":""},{"$f":"IF(Food_Reference!C751=\"\",\"\",Food_Reference!C751)","v":""}]
[{"$f":"IF(Food_Reference!A752=\"\",\"\",Food_Reference!A752)","v":""},{"$f":"IF(Food_Reference!B752=\"\",\"\",Food_Reference!B752)","v":""},{"$f":"IF(Food_Reference!C752=\"\",\"\",Food_Reference!C752)","v":""}]
[{"$f":"IF(Food_Reference!A753=\"\",\"\",Food_Reference!A753)","v":""},{"$f":"IF(Food_Reference!B753=\"\",\"\",Food_Reference!B753)","v":""},{"$f":"IF(Food_Reference!C753=\"\",\"\",Food_Reference!C753)","v":""}]
[{"$f":"IF(Food_Reference!A754=\"\",\"\",Food_Reference!A754)","v":""},{"$f":"IF(Food_Reference!B754=\"\",\"\",Food_Reference!B754)","v":""},{"$f":"IF(Food_Reference!C754=\"\",\"\",Food_Reference!C754)","v":""}]
[{"$f":"IF(Food_Reference!A755=\"\",\"\",Food_Reference!A755)","v":""},{"$f":"IF(Food_Reference!B755=\"\",\"\",Food_Reference!B755)","v":""},{"$f":"IF(Food_Reference!C755=\"\",\"\",Food_Reference!C755)","v":""}]
[{"$f":"IF(Food_Reference!A756=\"\",\"\",Food_Reference!A756)","v":""},{"$f":"IF(Food_Reference!B756=\"\",\"\",Food_Reference!B756)","v":""},{"$f":"IF(Food_Reference!C756=\"\",\"\",Food_Reference!C756)","v":""}]
[{"$f":"IF(Food_Reference!A757=\"\",\"\",Food_Reference!A757)","v":""},{"$f":"IF(Food_Reference!B757=\"\",\"\",Food_Reference!B757)","v":""},{"$f":"IF(Food_Reference!C757=\"\",\"\",Food_Reference!C757)","v":""}]
[{"$f":"IF(Food_Reference!A758=\"\",\"\",Food_Reference!A758)","v":""},{"$f":"IF(Food_Reference!B758=\"\",\"\",Food_Reference!B758)","v":""},{"$f":"IF(Food_Reference!C758=\"\",\"\",Food_Reference!C758)","v":""}]
[{"$f":"IF(Food_Reference!A759=\"\",\"\",Food_Reference!A759)","v":""},{"$f":"IF(Food_Reference!B759=\"\",\"\",Food_Reference!B759)","v":""},{"$f":"IF(Food_Reference!C759=\"\",\"\",Food_Reference!C759)","v":""}]
[{"$f":"IF(Food_Reference!A760=\"\",\"\",Food_Reference!A760)","v":""},{"$f":"IF(Food_Reference!B760=\"\",\"\",Food_Reference!B760)","v":""},{"$f":"IF(Food_Reference!C760=\"\",\"\",Food_Reference!C760)","v":""}]
[{"$f":"IF(Food_Reference!A761=\"\",\"\",Food_Reference!A761)","v":""},{"$f":"IF(Food_Reference!B761=\"\",\"\",Food_Reference!B761)","v":""},{"$f":"IF(Food_Reference!C761=\"\",\"\",Food_Reference!C761)","v":""}]
[{"$f":"IF(Food_Reference!A762=\"\",\"\",Food_Reference!A762)","v":""},{"$f":"IF(Food_Reference!B762=\"\",\"\",Food_Reference!B762)","v":""},{"$f":"IF(Food_Reference!C762=\"\",\"\",Food_Reference!C762)","v":""}]
[{"$f":"IF(Food_Reference!A763=\"\",\"\",Food_Reference!A763)","v":""},{"$f":"IF(Food_Reference!B763=\"\",\"\",Food_Reference!B763)","v":""},{"$f":"IF(Food_Reference!C763=\"\",\"\",Food_Reference!C763)","v":""}]
[{"$f":"IF(Food_Reference!A764=\"\",\"\",Food_Reference!A764)","v":""},{"$f":"IF(Food_Reference!B764=\"\",\"\",Food_Reference!B764)","v":""},{"$f":"IF(Food_Reference!C764=\"\",\"\",Food_Reference!C764)","v":""}]
[{"$f":"IF(Food_Reference!A765=\"\",\"\",Food_Reference!A765)","v":""},{"$f":"IF(Food_Reference!B765=\"\",\"\",Food_Reference!B765)","v":""},{"$f":"IF(Food_Reference!C765=\"\",\"\",Food_Reference!C765)","v":""}]
[{"$f":"IF(Food_Reference!A766=\"\",\"\",Food_Reference!A766)","v":""},{"$f":"IF(Food_Reference!B766=\"\",\"\",Food_Reference!B766)","v":""},{"$f":"IF(Food_Reference!C766=\"\",\"\",Food_Reference!C766)","v":""}]
[{"$f":"IF(Food_Reference!A767=\"\",\"\",Food_Reference!A767)","v":""},{"$f":"IF(Food_Reference!B767=\"\",\"\",Food_Reference!B767)","v":""},{"$f":"IF(Food_Reference!C767=\"\",\"\",Food_Reference!C767)","v":""}]
[{"$f":"IF(Food_Reference!A768=\"\",\"\",Food_Reference!A768)","v":""},{"$f":"IF(Food_Reference!B768=\"\",\"\",Food_Reference!B768)","v":""},{"$f":"IF(Food_Reference!C768=\"\",\"\",Food_Reference!C768)","v":""}]
[{"$f":"IF(Food_Reference!A769=\"\",\"\",Food_Reference!A769)","v":""},{"$f":"IF(Food_Reference!B769=\"\",\"\",Food_Reference!B769)","v":""},{"$f":"IF(Food_Reference!C769=\"\",\"\",Food_Reference!C769)","v":""}]
[{"$f":"IF(Food_Reference!A770=\"\",\"\",Food_Reference!A770)","v":""},{"$f":"IF(Food_Reference!B770=\"\",\"\",Food_Reference!B770)","v":""},{"$f":"IF(Food_Reference!C770=\"\",\"\",Food_Reference!C770)","v":""}]
[{"$f":"IF(Food_Reference!A771=\"\",\"\",Food_Reference!A771)","v":""},{"$f":"IF(Food_Reference!B771=\"\",\"\",Food_Reference!B771)","v":""},{"$f":"IF(Food_Reference!C771=\"\",\"\",Food_Reference!C771)","v":""}]
[{"$f":"IF(Food_Reference!A772=\"\",\"\",Food_Reference!A772)","v":""},{"$f":"IF(Food_Reference!B772=\"\",\"\",Food_Reference!B772)","v":""},{"$f":"IF(Food_Reference!C772=\"\",\"\",Food_Reference!C772)","v":""}]
[{"$f":"IF(Food_Reference!A773=\"\",\"\",Food_Reference!A773)","v":""},{"$f":"IF(Food_Reference!B773=\"\",\"\",Food_Reference!B773)","v":""},{"$f":"IF(Food_Reference!C773=\"\",\"\",Food_Reference!C773)","v":""}]
[{"$f":"IF(Food_Reference!A774=\"\",\"\",Food_Reference!A774)","v":""},{"$f":"IF(Food_Reference!B774=\"\",\"\",Food_Reference!B774)","v":""},{"$f":"IF(Food_Reference!C774=\"\",\"\",Food_Reference!C774)","v":""}]
[{"$f":"IF(Food_Reference!A775=\"\",\"\",Food_Reference!A775)","v":""},{"$f":"IF(Food_Reference!B775=\"\",\"\",Food_Reference!B775)","v":""},{"$f":"IF(Food_Reference!C775=\"\",\"\",Food_Reference!C775)","v":""}]
[{"$f":"IF(Food_Reference!A776=\"\",\"\",Food_Reference!A776)","v":""},{"$f":"IF(Food_Reference!B776=\"\",\"\",Food_Reference!B776)","v":""},{"$f":"IF(Food_Reference!C776=\"\",\"\",Food_Reference!C776)","v":""}]
[{"$f":"IF(Food_Reference!A777=\"\",\"\",Food_Reference!A777)","v":""},{"$f":"IF(Food_Reference!B777=\"\",\"\",Food_Reference!B777)","v":""},{"$f":"IF(Food_Reference!C777=\"\",\"\",Food_Reference!C777)","v":""}]
[{"$f":"IF(Food_Reference!A778=\"\",\"\",Food_Reference!A778)","v":""},{"$f":"IF(Food_Reference!B778=\"\",\"\",Food_Reference!B778)","v":""},{"$f":"IF(Food_Reference!C778=\"\",\"\",Food_Reference!C778)","v":""}]
[{"$f":"IF(Food_Reference!A779=\"\",\"\",Food_Reference!A779)","v":""},{"$f":"IF(Food_Reference!B779=\"\",\"\",Food_Reference!B779)","v":""},{"$f":"IF(Food_Reference!C779=\"\",\"\",Food_Reference!C779)","v":""}]
[{"$f":"IF(Food_Reference!A780=\"\",\"\",Food_Reference!A780)","v":""},{"$f":"IF(Food_Reference!B780=\"\",\"\",Food_Reference!B780)","v":""},{"$f":"IF(Food_Reference!C780=\"\",\"\",Food_Reference!C780)","v":""}]
[{"$f":"IF(Food_Reference!A781=\"\",\"\",Food_Reference!A781)","v":""},{"$f":"IF(Food_Reference!B781=\"\",\"\",Food_Reference!B781)","v":""},{"$f":"IF(Food_Reference!C781=\"\",\"\",Food_Reference!C781)","v":""}]
[{"$f":"IF(Food_Reference!A782=\"\",\"\",Food_Reference!A782)","v":""},{"$f":"IF(Food_Reference!B782=\"\",\"\",Food_Reference!B782)","v":""},{"$f":"IF(Food_Reference!C782=\"\",\"\",Food_Reference!C782)","v":""}]
[{"$f":"IF(Food_Reference!A783=\"\",\"\",Food_Reference!A783)","v":""},{"$f":"IF(Food_Reference!B783=\"\",\"\",Food_Reference!B783)","v":""},{"$f":"IF(Food_Reference!C783=\"\",\"\",Food_Reference!C783)","v":""}]
[{"$f":"IF(Food_Reference!A784=\"\",\"\",Food_Reference!A784)","v":""},{"$f":"IF(Food_Reference!B784=\"\",\"\",Food_Reference!B784)","v":""},{"$f":"IF(Food_Reference!C784=\"\",\"\",Food_Reference!C784)","v":""}]
[{"$f":"IF(Food_Reference!A785=\"\",\"\",Food_Reference!A785)","v":""},{"$f":"IF(Food_Reference!B785=\"\",\"\",Food_Reference!B785)","v":""},{"$f":"IF(Food_Reference!C785=\"\",\"\",Food_Reference!C785)","v":""}]
[{"$f":"IF(Food_Reference!A786=\"\",\"\",Food_Reference!A786)","v":""},{"$f":"IF(Food_Reference!B786=\"\",\"\",Food_Reference!B786)","v":""},{"$f":"IF(Food_Reference!C786=\"\",\"\",Food_Reference!C786)","v":""}]
[{"$f":"IF(Food_Reference!A787=\"\",\"\",Food_Reference!A787)","v":""},{"$f":"IF(Food_Reference!B787=\"\",\"\",Food_Reference!B787)","v":""},{"$f":"IF(Food_Reference!C787=\"\",\"\",Food_Reference!C787)","v":""}]
[{"$f":"IF(Food_Reference!A788=\"\",\"\",Food_Reference!A788)","v":""},{"$f":"IF(Food_Reference!B788=\"\",\"\",Food_Reference!B788)","v":""},{"$f":"IF(Food_Reference!C788=\"\",\"\",Food_Reference!C788)","v":""}]
[{"$f":"IF(Food_Reference!A789=\"\",\"\",Food_Reference!A789)","v":""},{"$f":"IF(Food_Reference!B789=\"\",\"\",Food_Reference!B789)","v":""},{"$f":"IF(Food_Reference!C789=\"\",\"\",Food_Reference!C789)","v":""}]
[{"$f":"IF(Food_Reference!A790=\"\",\"\",Food_Reference!A790)","v":""},{"$f":"IF(Food_Reference!B790=\"\",\"\",Food_Reference!B790)","v":""},{"$f":"IF(Food_Reference!C790=\"\",\"\",Food_Reference!C790)","v":""}]
[{"$f":"IF(Food_Reference!A791=\"\",\"\",Food_Reference!A791)","v":""},{"$f":"IF(Food_Reference!B791=\"\",\"\",Food_Reference!B791)","v":""},{"$f":"IF(Food_Reference!C791=\"\",\"\",Food_Reference!C791)","v":""}]
[{"$f":"IF(Food_Reference!A792=\"\",\"\",Food_Reference!A792)","v":""},{"$f":"IF(Food_Reference!B792=\"\",\"\",Food_Reference!B792)","v":""},{"$f":"IF(Food_Reference!C792=\"\",\"\",Food_Reference!C792)","v":""}]
[{"$f":"IF(Food_Reference!A793=\"\",\"\",Food_Reference!A793)","v":""},{"$f":"IF(Food_Reference!B793=\"\",\"\",Food_Reference!B793)","v":""},{"$f":"IF(Food_Reference!C793=\"\",\"\",Food_Reference!C793)","v":""}]
[{"$f":"IF(Food_Reference!A794=\"\",\"\",Food_Reference!A794)","v":""},{"$f":"IF(Food_Reference!B794=\"\",\"\",Food_Reference!B794)","v":""},{"$f":"IF(Food_Reference!C794=\"\",\"\",Food_Reference!C794)","v":""}]
[{"$f":"IF(Food_Reference!A795=\"\",\"\",Food_Reference!A795)","v":""},{"$f":"IF(Food_Reference!B795=\"\",\"\",Food_Reference!B795)","v":""},{"$f":"IF(Food_Reference!C795=\"\",\"\",Food_Reference!C795)","v":""}]
[{"$f":"IF(Food_Reference!A796=\"\",\"\",Food_Reference!A796)","v":""},{"$f":"IF(Food_Reference!B796=\"\",\"\",Food_Reference!B796)","v":""},{"$f":"IF(Food_Reference!C796=\"\",\"\",Food_Reference!C796)","v":""}]
[{"$f":"IF(Food_Reference!A797=\"\",\"\",Food_Reference!A797)","v":""},{"$f":"IF(Food_Reference!B797=\"\",\"\",Food_Reference!B797)","v":""},{"$f":"IF(Food_Reference!C797=\"\",\"\",Food_Reference!C797)","v":""}]
[{"$f":"IF(Food_Reference!A798=\"\",\"\",Food_Reference!A798)","v":""},{"$f":"IF(Food_Reference!B798=\"\",\"\",Food_Reference!B798)","v":""},{"$f":"IF(Food_Reference!C798=\"\",\"\",Food_Reference!C798)","v":""}]
[{"$f":"IF(Food_Reference!A799=\"\",\"\",Food_Reference!A799)","v":""},{"$f":"IF(Food_Reference!B799=\"\",\"\",Food_Reference!B799)","v":""},{"$f":"IF(Food_Reference!C799=\"\",\"\",Food_Reference!C799)","v":""}]
[{"$f":"IF(Food_Reference!A800=\"\",\"\",Food_Reference!A800)","v":""},{"$f":"IF(Food_Reference!B800=\"\",\"\",Food_Reference!B800)","v":""},{"$f":"IF(Food_Reference!C800=\"\",\"\",Food_Reference!C800)","v":""}]
[{"$f":"IF(Food_Reference!A801=\"\",\"\",Food_Reference!A801)","v":""},{"$f":"IF(Food_Reference!B801=\"\",\"\",Food_Reference!B801)","v":""},{"$f":"IF(Food_Reference!C801=\"\",\"\",Food_Reference!C801)","v":""}]
[{"$f":"IF(Food_Reference!A802=\"\",\"\",Food_Reference!A802)","v":""},{"$f":"IF(Food_Reference!B802=\"\",\"\",Food_Reference!B802)","v":""},{"$f":"IF(Food_Reference!C802=\"\",\"\",Food_Reference!C802)","v":""}]
[{"$f":"IF(Food_Reference!A803=\"\",\"\",Food_Reference!A803)","v":""},{"$f":"IF(Food_Reference!B803=\"\",\"\",Food_Reference!B803)","v":""},{"$f":"IF(Food_Reference!C803=\"\",\"\",Food_Reference!C803)","v":""}]
[{"$f":"IF(Food_Reference!A804=\"\",\"\",Food_Reference!A804)","v":""},{"$f":"IF(Food_Reference!B804=\"\",\"\",Food_Reference!B804)","v":""},{"$f":"IF(Food_Reference!C804=\"\",\"\",Food_Reference!C804)","v":""}]
[{"$f":"IF(Food_Reference!A805=\"\",\"\",Food_Reference!A805)","v":""},{"$f":"IF(Food_Reference!B805=\"\",\"\",Food_Reference!B805)","v":""},{"$f":"IF(Food_Reference!C805=\"\",\"\",Food_Reference!C805)","v":""}]
[{"$f":"IF(Food_Reference!A806=\"\",\"\",Food_Reference!A806)","v":""},{"$f":"IF(Food_Reference!B806=\"\",\"\",Food_Reference!B806)","v":""},{"$f":"IF(Food_Reference!C806=\"\",\"\",Food_Reference!C806)","v":""}]
[{"$f":"IF(Food_Reference!A807=\"\",\"\",Food_Reference!A807)","v":""},{"$f":"IF(Food_Reference!B807=\"\",\"\",Food_Reference!B807)","v":""},{"$f":"IF(Food_Reference!C807=\"\",\"\",Food_Reference!C807)","v":""}]
[{"$f":"IF(Food_Reference!A808=\"\",\"\",Food_Reference!A808)","v":""},{"$f":"IF(Food_Reference!B808=\"\",\"\",Food_Reference!B808)","v":""},{"$f":"IF(Food_Reference!C808=\"\",\"\",Food_Reference!C808)","v":""}]
[{"$f":"IF(Food_Reference!A809=\"\",\"\",Food_Reference!A809)","v":""},{"$f":"IF(Food_Reference!B809=\"\",\"\",Food_Reference!B809)","v":""},{"$f":"IF(Food_Reference!C809=\"\",\"\",Food_Reference!C809)","v":""}]
[{"$f":"IF(Food_Reference!A810=\"\",\"\",Food_Reference!A810)","v":""},{"$f":"IF(Food_Reference!B810=\"\",\"\",Food_Reference!B810)","v":""},{"$f":"IF(Food_Reference!C810=\"\",\"\",Food_Reference!C810)","v":""}]
[{"$f":"IF(Food_Reference!A811=\"\",\"\",Food_Reference!A811)","v":""},{"$f":"IF(Food_Reference!B811=\"\",\"\",Food_Reference!B811)","v":""},{"$f":"IF(Food_Reference!C811=\"\",\"\",Food_Reference!C811)","v":""}]
[{"$f":"IF(Food_Reference!A812=\"\",\"\",Food_Reference!A812)","v":""},{"$f":"IF(Food_Reference!B812=\"\",\"\",Food_Reference!B812)","v":""},{"$f":"IF(Food_Reference!C812=\"\",\"\",Food_Reference!C812)","v":""}]
[{"$f":"IF(Food_Reference!A813=\"\",\"\",Food_Reference!A813)","v":""},{"$f":"IF(Food_Reference!B813=\"\",\"\",Food_Reference!B813)","v":""},{"$f":"IF(Food_Reference!C813=\"\",\"\",Food_Reference!C813)","v":""}]
[{"$f":"IF(Food_Reference!A814=\"\",\"\",Food_Reference!A814)","v":""},{"$f":"IF(Food_Reference!B814=\"\",\"\",Food_Reference!B814)","v":""},{"$f":"IF(Food_Reference!C814=\"\",\"\",Food_Reference!C814)","v":""}]
[{"$f":"IF(Food_Reference!A815=\"\",\"\",Food_Reference!A815)","v":""},{"$f":"IF(Food_Reference!B815=\"\",\"\",Food_Reference!B815)","v":""},{"$f":"IF(Food_Reference!C815=\"\",\"\",Food_Reference!C815)","v":""}]
[{"$f":"IF(Food_Reference!A816=\"\",\"\",Food_Reference!A816)","v":""},{"$f":"IF(Food_Reference!B816=\"\",\"\",Food_Reference!B816)","v":""},{"$f":"IF(Food_Reference!C816=\"\",\"\",Food_Reference!C816)","v":""}]
[{"$f":"IF(Food_Reference!A817=\"\",\"\",Food_Reference!A817)","v":""},{"$f":"IF(Food_Reference!B817=\"\",\"\",Food_Reference!B817)","v":""},{"$f":"IF(Food_Reference!C817=\"\",\"\",Food_Reference!C817)","v":""}]
[{"$f":"IF(Food_Reference!A818=\"\",\"\",Food_Reference!A818)","v":""},{"$f":"IF(Food_Reference!B818=\"\",\"\",Food_Reference!B818)","v":""},{"$f":"IF(Food_Reference!C818=\"\",\"\",Food_Reference!C818)","v":""}]
[{"$f":"IF(Food_Reference!A819=\"\",\"\",Food_Reference!A819)","v":""},{"$f":"IF(Food_Reference!B819=\"\",\"\",Food_Reference!B819)","v":""},{"$f":"IF(Food_Reference!C819=\"\",\"\",Food_Reference!C819)","v":""}]
[{"$f":"IF(Food_Reference!A820=\"\",\"\",Food_Reference!A820)","v":""},{"$f":"IF(Food_Reference!B820=\"\",\"\",Food_Reference!B820)","v":""},{"$f":"IF(Food_Reference!C820=\"\",\"\",Food_Reference!C820)","v":""}]
[{"$f":"IF(Food_Reference!A821=\"\",\"\",Food_Reference!A821)","v":""},{"$f":"IF(Food_Reference!B821=\"\",\"\",Food_Reference!B821)","v":""},{"$f":"IF(Food_Reference!C821=\"\",\"\",Food_Reference!C821)","v":""}]
[{"$f":"IF(Food_Reference!A822=\"\",\"\",Food_Reference!A822)","v":""},{"$f":"IF(Food_Reference!B822=\"\",\"\",Food_Reference!B822)","v":""},{"$f":"IF(Food_Reference!C822=\"\",\"\",Food_Reference!C822)","v":""}]
[{"$f":"IF(Food_Reference!A823=\"\",\"\",Food_Reference!A823)","v":""},{"$f":"IF(Food_Reference!B823=\"\",\"\",Food_Reference!B823)","v":""},{"$f":"IF(Food_Reference!C823=\"\",\"\",Food_Reference!C823)","v":""}]
[{"$f":"IF(Food_Reference!A824=\"\",\"\",Food_Reference!A824)","v":""},{"$f":"IF(Food_Reference!B824=\"\",\"\",Food_Reference!B824)","v":""},{"$f":"IF(Food_Reference!C824=\"\",\"\",Food_Reference!C824)","v":""}]
[{"$f":"IF(Food_Reference!A825=\"\",\"\",Food_Reference!A825)","v":""},{"$f":"IF(Food_Reference!B825=\"\",\"\",Food_Reference!B825)","v":""},{"$f":"IF(Food_Reference!C825=\"\",\"\",Food_Reference!C825)","v":""}]
[{"$f":"IF(Food_Reference!A826=\"\",\"\",Food_Reference!A826)","v":""},{"$f":"IF(Food_Reference!B826=\"\",\"\",Food_Reference!B826)","v":""},{"$f":"IF(Food_Reference!C826=\"\",\"\",Food_Reference!C826)","v":""}]
[{"$f":"IF(Food_Reference!A827=\"\",\"\",Food_Reference!A827)","v":""},{"$f":"IF(Food_Reference!B827=\"\",\"\",Food_Reference!B827)","v":""},{"$f":"IF(Food_Reference!C827=\"\",\"\",Food_Reference!C827)","v":""}]
[{"$f":"IF(Food_Reference!A828=\"\",\"\",Food_Reference!A828)","v":""},{"$f":"IF(Food_Reference!B828=\"\",\"\",Food_Reference!B828)","v":""},{"$f":"IF(Food_Reference!C828=\"\",\"\",Food_Reference!C828)","v":""}]
[{"$f":"IF(Food_Reference!A829=\"\",\"\",Food_Reference!A829)","v":""},{"$f":"IF(Food_Reference!B829=\"\",\"\",Food_Reference!B829)","v":""},{"$f":"IF(Food_Reference!C829=\"\",\"\",Food_Reference!C829)","v":""}]
[{"$f":"IF(Food_Reference!A830=\"\",\"\",Food_Reference!A830)","v":""},{"$f":"IF(Food_Reference!B830=\"\",\"\",Food_Reference!B830)","v":""},{"$f":"IF(Food_Reference!C830=\"\",\"\",Food_Reference!C830)","v":""}]
[{"$f":"IF(Food_Reference!A831=\"\",\"\",Food_Reference!A831)","v":""},{"$f":"IF(Food_Reference!B831=\"\",\"\",Food_Reference!B831)","v":""},{"$f":"IF(Food_Reference!C831=\"\",\"\",Food_Reference!C831)","v":""}]
[{"$f":"IF(Food_Reference!A832=\"\",\"\",Food_Reference!A832)","v":""},{"$f":"IF(Food_Reference!B832=\"\",\"\",Food_Reference!B832)","v":""},{"$f":"IF(Food_Reference!C832=\"\",\"\",Food_Reference!C832)","v":""}]
[{"$f":"IF(Food_Reference!A833=\"\",\"\",Food_Reference!A833)","v":""},{"$f":"IF(Food_Reference!B833=\"\",\"\",Food_Reference!B833)","v":""},{"$f":"IF(Food_Reference!C833=\"\",\"\",Food_Reference!C833)","v":""}]
[{"$f":"IF(Food_Reference!A834=\"\",\"\",Food_Reference!A834)","v":""},{"$f":"IF(Food_Reference!B834=\"\",\"\",Food_Reference!B834)","v":""},{"$f":"IF(Food_Reference!C834=\"\",\"\",Food_Reference!C834)","v":""}]
[{"$f":"IF(Food_Reference!A835=\"\",\"\",Food_Reference!A835)","v":""},{"$f":"IF(Food_Reference!B835=\"\",\"\",Food_Reference!B835)","v":""},{"$f":"IF(Food_Reference!C835=\"\",\"\",Food_Reference!C835)","v":""}]
[{"$f":"IF(Food_Reference!A836=\"\",\"\",Food_Reference!A836)","v":""},{"$f":"IF(Food_Reference!B836=\"\",\"\",Food_Reference!B836)","v":""},{"$f":"IF(Food_Reference!C836=\"\",\"\",Food_Reference!C836)","v":""}]
[{"$f":"IF(Food_Reference!A837=\"\",\"\",Food_Reference!A837)","v":""},{"$f":"IF(Food_Reference!B837=\"\",\"\",Food_Reference!B837)","v":""},{"$f":"IF(Food_Reference!C837=\"\",\"\",Food_Reference!C837)","v":""}]
[{"$f":"IF(Food_Reference!A838=\"\",\"\",Food_Reference!A838)","v":""},{"$f":"IF(Food_Reference!B838=\"\",\"\",Food_Reference!B838)","v":""},{"$f":"IF(Food_Reference!C838=\"\",\"\",Food_Reference!C838)","v":""}]
[{"$f":"IF(Food_Reference!A839=\"\",\"\",Food_Reference!A839)","v":""},{"$f":"IF(Food_Reference!B839=\"\",\"\",Food_Reference!B839)","v":""},{"$f":"IF(Food_Reference!C839=\"\",\"\",Food_Reference!C839)","v":""}]
[{"$f":"IF(Food_Reference!A840=\"\",\"\",Food_Reference!A840)","v":""},{"$f":"IF(Food_Reference!B840=\"\",\"\",Food_Reference!B840)","v":""},{"$f":"IF(Food_Reference!C840=\"\",\"\",Food_Reference!C840)","v":""}]
[{"$f":"IF(Food_Reference!A841=\"\",\"\",Food_Reference!A841)","v":""},{"$f":"IF(Food_Reference!B841=\"\",\"\",Food_Reference!B841)","v":""},{"$f":"IF(Food_Reference!C841=\"\",\"\",Food_Reference!C841)","v":""}]
[{"$f":"IF(Food_Reference!A842=\"\",\"\",Food_Reference!A842)","v":""},{"$f":"IF(Food_Reference!B842=\"\",\"\",Food_Reference!B842)","v":""},{"$f":"IF(Food_Reference!C842=\"\",\"\",Food_Reference!C842)","v":""}]
[{"$f":"IF(Food_Reference!A843=\"\",\"\",Food_Reference!A843)","v":""},{"$f":"IF(Food_Reference!B843=\"\",\"\",Food_Reference!B843)","v":""},{"$f":"IF(Food_Reference!C843=\"\",\"\",Food_Reference!C843)","v":""}]
[{"$f":"IF(Food_Reference!A844=\"\",\"\",Food_Reference!A844)","v":""},{"$f":"IF(Food_Reference!B844=\"\",\"\",Food_Reference!B844)","v":""},{"$f":"IF(Food_Reference!C844=\"\",\"\",Food_Reference!C844)","v":""}]
[{"$f":"IF(Food_Reference!A845=\"\",\"\",Food_Reference!A845)","v":""},{"$f":"IF(Food_Reference!B845=\"\",\"\",Food_Reference!B845)","v":""},{"$f":"IF(Food_Reference!C845=\"\",\"\",Food_Reference!C845)","v":""}]
[{"$f":"IF(Food_Reference!A846=\"\",\"\",Food_Reference!A846)","v":""},{"$f":"IF(Food_Reference!B846=\"\",\"\",Food_Reference!B846)","v":""},{"$f":"IF(Food_Reference!C846=\"\",\"\",Food_Reference!C846)","v":""}]
[{"$f":"IF(Food_Reference!A847=\"\",\"\",Food_Reference!A847)","v":""},{"$f":"IF(Food_Reference!B847=\"\",\"\",Food_Reference!B847)","v":""},{"$f":"IF(Food_Reference!C847=\"\",\"\",Food_Reference!C847)","v":""}]
[{"$f":"IF(Food_Reference!A848=\"\",\"\",Food_Reference!A848)","v":""},{"$f":"IF(Food_Reference!B848=\"\",\"\",Food_Reference!B848)","v":""},{"$f":"IF(Food_Reference!C848=\"\",\"\",Food_Reference!C848)","v":""}]
[{"$f":"IF(Food_Reference!A849=\"\",\"\",Food_Reference!A849)","v":""},{"$f":"IF(Food_Reference!B849=\"\",\"\",Food_Reference!B849)","v":""},{"$f":"IF(Food_Reference!C849=\"\",\"\",Food_Reference!C849)","v":""}]
[{"$f":"IF(Food_Reference!A850=\"\",\"\",Food_Reference!A850)","v":""},{"$f":"IF(Food_Reference!B850=\"\",\"\",Food_Reference!B850)","v":""},{"$f":"IF(Food_Reference!C850=\"\",\"\",Food_Reference!C850)","v":""}]
[{"$f":"IF(Food_Reference!A851=\"\",\"\",Food_Reference!A851)","v":""},{"$f":"IF(Food_Reference!B851=\"\",\"\",Food_Reference!B851)","v":""},{"$f":"IF(Food_Reference!C851=\"\",\"\",Food_Reference!C851)","v":""}]
[{"$f":"IF(Food_Reference!A852=\"\",\"\",Food_Reference!A852)","v":""},{"$f":"IF(Food_Reference!B852=\"\",\"\",Food_Reference!B852)","v":""},{"$f":"IF(Food_Reference!C852=\"\",\"\",Food_Reference!C852)","v":""}]
[{"$f":"IF(Food_Reference!A853=\"\",\"\",Food_Reference!A853)","v":""},{"$f":"IF(Food_Reference!B853=\"\",\"\",Food_Reference!B853)","v":""},{"$f":"IF(Food_Reference!C853=\"\",\"\",Food_Reference!C853)","v":""}]
[{"$f":"IF(Food_Reference!A854=\"\",\"\",Food_Reference!A854)","v":""},{"$f":"IF(Food_Reference!B854=\"\",\"\",Food_Reference!B854)","v":""},{"$f":"IF(Food_Reference!C854=\"\",\"\",Food_Reference!C854)","v":""}]
[{"$f":"IF(Food_Reference!A855=\"\",\"\",Food_Reference!A855)","v":""},{"$f":"IF(Food_Reference!B855=\"\",\"\",Food_Reference!B855)","v":""},{"$f":"IF(Food_Reference!C855=\"\",\"\",Food_Reference!C855)","v":""}]
[{"$f":"IF(Food_Reference!A856=\"\",\"\",Food_Reference!A856)","v":""},{"$f":"IF(Food_Reference!B856=\"\",\"\",Food_Reference!B856)","v":""},{"$f":"IF(Food_Reference!C856=\"\",\"\",Food_Reference!C856)","v":""}]
[{"$f":"IF(Food_Reference!A857=\"\",\"\",Food_Reference!A857)","v":""},{"$f":"IF(Food_Reference!B857=\"\",\"\",Food_Reference!B857)","v":""},{"$f":"IF(Food_Reference!C857=\"\",\"\",Food_Reference!C857)","v":""}]
[{"$f":"IF(Food_Reference!A858=\"\",\"\",Food_Reference!A858)","v":""},{"$f":"IF(Food_Reference!B858=\"\",\"\",Food_Reference!B858)","v":""},{"$f":"IF(Food_Reference!C858=\"\",\"\",Food_Reference!C858)","v":""}]
[{"$f":"IF(Food_Reference!A859=\"\",\"\",Food_Reference!A859)","v":""},{"$f":"IF(Food_Reference!B859=\"\",\"\",Food_Reference!B859)","v":""},{"$f":"IF(Food_Reference!C859=\"\",\"\",Food_Reference!C859)","v":""}]
[{"$f":"IF(Food_Reference!A860=\"\",\"\",Food_Reference!A860)","v":""},{"$f":"IF(Food_Reference!B860=\"\",\"\",Food_Reference!B860)","v":""},{"$f":"IF(Food_Reference!C860=\"\",\"\",Food_Reference!C860)","v":""}]
[{"$f":"IF(Food_Reference!A861=\"\",\"\",Food_Reference!A861)","v":""},{"$f":"IF(Food_Reference!B861=\"\",\"\",Food_Reference!B861)","v":""},{"$f":"IF(Food_Reference!C861=\"\",\"\",Food_Reference!C861)","v":""}]
[{"$f":"IF(Food_Reference!A862=\"\",\"\",Food_Reference!A862)","v":""},{"$f":"IF(Food_Reference!B862=\"\",\"\",Food_Reference!B862)","v":""},{"$f":"IF(Food_Reference!C862=\"\",\"\",Food_Reference!C862)","v":""}]
[{"$f":"IF(Food_Reference!A863=\"\",\"\",Food_Reference!A863)","v":""},{"$f":"IF(Food_Reference!B863=\"\",\"\",Food_Reference!B863)","v":""},{"$f":"IF(Food_Reference!C863=\"\",\"\",Food_Reference!C863)","v":""}]
[{"$f":"IF(Food_Reference!A864=\"\",\"\",Food_Reference!A864)","v":""},{"$f":"IF(Food_Reference!B864=\"\",\"\",Food_Reference!B864)","v":""},{"$f":"IF(Food_Reference!C864=\"\",\"\",Food_Reference!C864)","v":""}]
[{"$f":"IF(Food_Reference!A865=\"\",\"\",Food_Reference!A865)","v":""},{"$f":"IF(Food_Reference!B865=\"\",\"\",Food_Reference!B865)","v":""},{"$f":"IF(Food_Reference!C865=\"\",\"\",Food_Reference!C865)","v":""}]
[{"$f":"IF(Food_Reference!A866=\"\",\"\",Food_Reference!A866)","v":""},{"$f":"IF(Food_Reference!B866=\"\",\"\",Food_Reference!B866)","v":""},{"$f":"IF(Food_Reference!C866=\"\",\"\",Food_Reference!C866)","v":""}]
[{"$f":"IF(Food_Reference!A867=\"\",\"\",Food_Reference!A867)","v":""},{"$f":"IF(Food_Reference!B867=\"\",\"\",Food_Reference!B867)","v":""},{"$f":"IF(Food_Reference!C867=\"\",\"\",Food_Reference!C867)","v":""}]
[{"$f":"IF(Food_Reference!A868=\"\",\"\",Food_Reference!A868)","v":""},{"$f":"IF(Food_Reference!B868=\"\",\"\",Food_Reference!B868)","v":""},{"$f":"IF(Food_Reference!C868=\"\",\"\",Food_Reference!C868)","v":""}]
[{"$f":"IF(Food_Reference!A869=\"\",\"\",Food_Reference!A869)","v":""},{"$f":"IF(Food_Reference!B869=\"\",\"\",Food_Reference!B869)","v":""},{"$f":"IF(Food_Reference!C869=\"\",\"\",Food_Reference!C869)","v":""}]
[{"$f":"IF(Food_Reference!A870=\"\",\"\",Food_Reference!A870)","v":""},{"$f":"IF(Food_Reference!B870=\"\",\"\",Food_Reference!B870)","v":""},{"$f":"IF(Food_Reference!C870=\"\",\"\",Food_Reference!C870)","v":""}]
[{"$f":"IF(Food_Reference!A871=\"\",\"\",Food_Reference!A871)","v":""},{"$f":"IF(Food_Reference!B871=\"\",\"\",Food_Reference!B871)","v":""},{"$f":"IF(Food_Reference!C871=\"\",\"\",Food_Reference!C871)","v":""}]
[{"$f":"IF(Food_Reference!A872=\"\",\"\",Food_Reference!A872)","v":""},{"$f":"IF(Food_Reference!B872=\"\",\"\",Food_Reference!B872)","v":""},{"$f":"IF(Food_Reference!C872=\"\",\"\",Food_Reference!C872)","v":""}]
[{"$f":"IF(Food_Reference!A873=\"\",\"\",Food_Reference!A873)","v":""},{"$f":"IF(Food_Reference!B873=\"\",\"\",Food_Reference!B873)","v":""},{"$f":"IF(Food_Reference!C873=\"\",\"\",Food_Reference!C873)","v":""}]
[{"$f":"IF(Food_Reference!A874=\"\",\"\",Food_Reference!A874)","v":""},{"$f":"IF(Food_Reference!B874=\"\",\"\",Food_Reference!B874)","v":""},{"$f":"IF(Food_Reference!C874=\"\",\"\",Food_Reference!C874)","v":""}]
[{"$f":"IF(Food_Reference!A875=\"\",\"\",Food_Reference!A875)","v":""},{"$f":"IF(Food_Reference!B875=\"\",\"\",Food_Reference!B875)","v":""},{"$f":"IF(Food_Reference!C875=\"\",\"\",Food_Reference!C875)","v":""}]
[{"$f":"IF(Food_Reference!A876=\"\",\"\",Food_Reference!A876)","v":""},{"$f":"IF(Food_Reference!B876=\"\",\"\",Food_Reference!B876)","v":""},{"$f":"IF(Food_Reference!C876=\"\",\"\",Food_Reference!C876)","v":""}]
[{"$f":"IF(Food_Reference!A877=\"\",\"\",Food_Reference!A877)","v":""},{"$f":"IF(Food_Reference!B877=\"\",\"\",Food_Reference!B877)","v":""},{"$f":"IF(Food_Reference!C877=\"\",\"\",Food_Reference!C877)","v":""}]
[{"$f":"IF(Food_Reference!A878=\"\",\"\",Food_Reference!A878)","v":""},{"$f":"IF(Food_Reference!B878=\"\",\"\",Food_Reference!B878)","v":""},{"$f":"IF(Food_Reference!C878=\"\",\"\",Food_Reference!C878)","v":""}]
[{"$f":"IF(Food_Reference!A879=\"\",\"\",Food_Reference!A879)","v":""},{"$f":"IF(Food_Reference!B879=\"\",\"\",Food_Reference!B879)","v":""},{"$f":"IF(Food_Reference!C879=\"\",\"\",Food_Reference!C879)","v":""}]
[{"$f":"IF(Food_Reference!A880=\"\",\"\",Food_Reference!A880)","v":""},{"$f":"IF(Food_Reference!B880=\"\",\"\",Food_Reference!B880)","v":""},{"$f":"IF(Food_Reference!C880=\"\",\"\",Food_Reference!C880)","v":""}]
[{"$f":"IF(Food_Reference!A881=\"\",\"\",Food_Reference!A881)","v":""},{"$f":"IF(Food_Reference!B881=\"\",\"\",Food_Reference!B881)","v":""},{"$f":"IF(Food_Reference!C881=\"\",\"\",Food_Reference!C881)","v":""}]
[{"$f":"IF(Food_Reference!A882=\"\",\"\",Food_Reference!A882)","v":""},{"$f":"IF(Food_Reference!B882=\"\",\"\",Food_Reference!B882)","v":""},{"$f":"IF(Food_Reference!C882=\"\",\"\",Food_Reference!C882)","v":""}]
[{"$f":"IF(Food_Reference!A883=\"\",\"\",Food_Reference!A883)","v":""},{"$f":"IF(Food_Reference!B883=\"\",\"\",Food_Reference!B883)","v":""},{"$f":"IF(Food_Reference!C883=\"\",\"\",Food_Reference!C883)","v":""}]
[{"$f":"IF(Food_Reference!A884=\"\",\"\",Food_Reference!A884)","v":""},{"$f":"IF(Food_Reference!B884=\"\",\"\",Food_Reference!B884)","v":""},{"$f":"IF(Food_Reference!C884=\"\",\"\",Food_Reference!C884)","v":""}]
[{"$f":"IF(Food_Reference!A885=\"\",\"\",Food_Reference!A885)","v":""},{"$f":"IF(Food_Reference!B885=\"\",\"\",Food_Reference!B885)","v":""},{"$f":"IF(Food_Reference!C885=\"\",\"\",Food_Reference!C885)","v":""}]
[{"$f":"IF(Food_Reference!A886=\"\",\"\",Food_Reference!A886)","v":""},{"$f":"IF(Food_Reference!B886=\"\",\"\",Food_Reference!B886)","v":""},{"$f":"IF(Food_Reference!C886=\"\",\"\",Food_Reference!C886)","v":""}]
[{"$f":"IF(Food_Reference!A887=\"\",\"\",Food_Reference!A887)","v":""},{"$f":"IF(Food_Reference!B887=\"\",\"\",Food_Reference!B887)","v":""},{"$f":"IF(Food_Reference!C887=\"\",\"\",Food_Reference!C887)","v":""}]
[{"$f":"IF(Food_Reference!A888=\"\",\"\",Food_Reference!A888)","v":""},{"$f":"IF(Food_Reference!B888=\"\",\"\",Food_Reference!B888)","v":""},{"$f":"IF(Food_Reference!C888=\"\",\"\",Food_Reference!C888)","v":""}]
[{"$f":"IF(Food_Reference!A889=\"\",\"\",Food_Reference!A889)","v":""},{"$f":"IF(Food_Reference!B889=\"\",\"\",Food_Reference!B889)","v":""},{"$f":"IF(Food_Reference!C889=\"\",\"\",Food_Reference!C889)","v":""}]
[{"$f":"IF(Food_Reference!A890=\"\",\"\",Food_Reference!A890)","v":""},{"$f":"IF(Food_Reference!B890=\"\",\"\",Food_Reference!B890)","v":""},{"$f":"IF(Food_Reference!C890=\"\",\"\",Food_Reference!C890)","v":""}]
[{"$f":"IF(Food_Reference!A891=\"\",\"\",Food_Reference!A891)","v":""},{"$f":"IF(Food_Reference!B891=\"\",\"\",Food_Reference!B891)","v":""},{"$f":"IF(Food_Reference!C891=\"\",\"\",Food_Reference!C891)","v":""}]
[{"$f":"IF(Food_Reference!A892=\"\",\"\",Food_Reference!A892)","v":""},{"$f":"IF(Food_Reference!B892=\"\",\"\",Food_Reference!B892)","v":""},{"$f":"IF(Food_Reference!C892=\"\",\"\",Food_Reference!C892)","v":""}]
[{"$f":"IF(Food_Reference!A893=\"\",\"\",Food_Reference!A893)","v":""},{"$f":"IF(Food_Reference!B893=\"\",\"\",Food_Reference!B893)","v":""},{"$f":"IF(Food_Reference!C893=\"\",\"\",Food_Reference!C893)","v":""}]
[{"$f":"IF(Food_Reference!A894=\"\",\"\",Food_Reference!A894)","v":""},{"$f":"IF(Food_Reference!B894=\"\",\"\",Food_Reference!B894)","v":""},{"$f":"IF(Food_Reference!C894=\"\",\"\",Food_Reference!C894)","v":""}]
[{"$f":"IF(Food_Reference!A895=\"\",\"\",Food_Reference!A895)","v":""},{"$f":"IF(Food_Reference!B895=\"\",\"\",Food_Reference!B895)","v":""},{"$f":"IF(Food_Reference!C895=\"\",\"\",Food_Reference!C895)","v":""}]
[{"$f":"IF(Food_Reference!A896=\"\",\"\",Food_Reference!A896)","v":""},{"$f":"IF(Food_Reference!B896=\"\",\"\",Food_Reference!B896)","v":""},{"$f":"IF(Food_Reference!C896=\"\",\"\",Food_Reference!C896)","v":""}]
[{"$f":"IF(Food_Reference!A897=\"\",\"\",Food_Reference!A897)","v":""},{"$f":"IF(Food_Reference!B897=\"\",\"\",Food_Reference!B897)","v":""},{"$f":"IF(Food_Reference!C897=\"\",\"\",Food_Reference!C897)","v":""}]
[{"$f":"IF(Food_Reference!A898=\"\",\"\",Food_Reference!A898)","v":""},{"$f":"IF(Food_Reference!B898=\"\",\"\",Food_Reference!B898)","v":""},{"$f":"IF(Food_Reference!C898=\"\",\"\",Food_Reference!C898)","v":""}]
[{"$f":"IF(Food_Reference!A899=\"\",\"\",Food_Reference!A899)","v":""},{"$f":"IF(Food_Reference!B899=\"\",\"\",Food_Reference!B899)","v":""},{"$f":"IF(Food_Reference!C899=\"\",\"\",Food_Reference!C899)","v":""}]
[{"$f":"IF(Food_Reference!A900=\"\",\"\",Food_Reference!A900)","v":""},{"$f":"IF(Food_Reference!B900=\"\",\"\",Food_Reference!B900)","v":""},{"$f":"IF(Food_Reference!C900=\"\",\"\",Food_Reference!C900)","v":""}]
[{"$f":"IF(Food_Reference!A901=\"\",\"\",Food_Reference!A901)","v":""},{"$f":"IF(Food_Reference!B901=\"\",\"\",Food_Reference!B901)","v":""},{"$f":"IF(Food_Reference!C901=\"\",\"\",Food_Reference!C901)","v":""}]
[{"$f":"IF(Food_Reference!A902=\"\",\"\",Food_Reference!A902)","v":""},{"$f":"IF(Food_Reference!B902=\"\",\"\",Food_Reference!B902)","v":""},{"$f":"IF(Food_Reference!C902=\"\",\"\",Food_Reference!C902)","v":""}]
[{"$f":"IF(Food_Reference!A903=\"\",\"\",Food_Reference!A903)","v":""},{"$f":"IF(Food_Reference!B903=\"\",\"\",Food_Reference!B903)","v":""},{"$f":"IF(Food_Reference!C903=\"\",\"\",Food_Reference!C903)","v":""}]
[{"$f":"IF(Food_Reference!A904=\"\",\"\",Food_Reference!A904)","v":""},{"$f":"IF(Food_Reference!B904=\"\",\"\",Food_Reference!B904)","v":""},{"$f":"IF(Food_Reference!C904=\"\",\"\",Food_Reference!C904)","v":""}]
[{"$f":"IF(Food_Reference!A905=\"\",\"\",Food_Reference!A905)","v":""},{"$f":"IF(Food_Reference!B905=\"\",\"\",Food_Reference!B905)","v":""},{"$f":"IF(Food_Reference!C905=\"\",\"\",Food_Reference!C905)","v":""}]
[{"$f":"IF(Food_Reference!A906=\"\",\"\",Food_Reference!A906)","v":""},{"$f":"IF(Food_Reference!B906=\"\",\"\",Food_Reference!B906)","v":""},{"$f":"IF(Food_Reference!C906=\"\",\"\",Food_Reference!C906)","v":""}]
[{"$f":"IF(Food_Reference!A907=\"\",\"\",Food_Reference!A907)","v":""},{"$f":"IF(Food_Reference!B907=\"\",\"\",Food_Reference!B907)","v":""},{"$f":"IF(Food_Reference!C907=\"\",\"\",Food_Reference!C907)","v":""}]
[{"$f":"IF(Food_Reference!A908=\"\",\"\",Food_Reference!A908)","v":""},{"$f":"IF(Food_Reference!B908=\"\",\"\",Food_Reference!B908)","v":""},{"$f":"IF(Food_Reference!C908=\"\",\"\",Food_Reference!C908)","v":""}]
[{"$f":"IF(Food_Reference!A909=\"\",\"\",Food_Reference!A909)","v":""},{"$f":"IF(Food_Reference!B909=\"\",\"\",Food_Reference!B909)","v":""},{"$f":"IF(Food_Reference!C909=\"\",\"\",Food_Reference!C909)","v":""}]
[{"$f":"IF(Food_Reference!A910=\"\",\"\",Food_Reference!A910)","v":""},{"$f":"IF(Food_Reference!B910=\"\",\"\",Food_Reference!B910)","v":""},{"$f":"IF(Food_Reference!C910=\"\",\"\",Food_Reference!C910)","v":""}]
[{"$f":"IF(Food_Reference!A911=\"\",\"\",Food_Reference!A911)","v":""},{"$f":"IF(Food_Reference!B911=\"\",\"\",Food_Reference!B911)","v":""},{"$f":"IF(Food_Reference!C911=\"\",\"\",Food_Reference!C911)","v":""}]
[{"$f":"IF(Food_Reference!A912=\"\",\"\",Food_Reference!A912)","v":""},{"$f":"IF(Food_Reference!B912=\"\",\"\",Food_Reference!B912)","v":""},{"$f":"IF(Food_Reference!C912=\"\",\"\",Food_Reference!C912)","v":""}]
[{"$f":"IF(Food_Reference!A913=\"\",\"\",Food_Reference!A913)","v":""},{"$f":"IF(Food_Reference!B913=\"\",\"\",Food_Reference!B913)","v":""},{"$f":"IF(Food_Reference!C913=\"\",\"\",Food_Reference!C913)","v":""}]
[{"$f":"IF(Food_Reference!A914=\"\",\"\",Food_Reference!A914)","v":""},{"$f":"IF(Food_Reference!B914=\"\",\"\",Food_Reference!B914)","v":""},{"$f":"IF(Food_Reference!C914=\"\",\"\",Food_Reference!C914)","v":""}]
[{"$f":"IF(Food_Reference!A915=\"\",\"\",Food_Reference!A915)","v":""},{"$f":"IF(Food_Reference!B915=\"\",\"\",Food_Reference!B915)","v":""},{"$f":"IF(Food_Reference!C915=\"\",\"\",Food_Reference!C915)","v":""}]
[{"$f":"IF(Food_Reference!A916=\"\",\"\",Food_Reference!A916)","v":""},{"$f":"IF(Food_Reference!B916=\"\",\"\",Food_Reference!B916)","v":""},{"$f":"IF(Food_Reference!C916=\"\",\"\",Food_Reference!C916)","v":""}]
[{"$f":"IF(Food_Reference!A917=\"\",\"\",Food_Reference!A917)","v":""},{"$f":"IF(Food_Reference!B917=\"\",\"\",Food_Reference!B917)","v":""},{"$f":"IF(Food_Reference!C917=\"\",\"\",Food_Reference!C917)","v":""}]
[{"$f":"IF(Food_Reference!A918=\"\",\"\",Food_Reference!A918)","v":""},{"$f":"IF(Food_Reference!B918=\"\",\"\",Food_Reference!B918)","v":""},{"$f":"IF(Food_Reference!C918=\"\",\"\",Food_Reference!C918)","v":""}]
[{"$f":"IF(Food_Reference!A919=\"\",\"\",Food_Reference!A919)","v":""},{"$f":"IF(Food_Reference!B919=\"\",\"\",Food_Reference!B919)","v":""},{"$f":"IF(Food_Reference!C919=\"\",\"\",Food_Reference!C919)","v":""}]
[{"$f":"IF(Food_Reference!A920=\"\",\"\",Food_Reference!A920)","v":""},{"$f":"IF(Food_Reference!B920=\"\",\"\",Food_Reference!B920)","v":""},{"$f":"IF(Food_Reference!C920=\"\",\"\",Food_Reference!C920)","v":""}]
[{"$f":"IF(Food_Reference!A921=\"\",\"\",Food_Reference!A921)","v":""},{"$f":"IF(Food_Reference!B921=\"\",\"\",Food_Reference!B921)","v":""},{"$f":"IF(Food_Reference!C921=\"\",\"\",Food_Reference!C921)","v":""}]
[{"$f":"IF(Food_Reference!A922=\"\",\"\",Food_Reference!A922)","v":""},{"$f":"IF(Food_Reference!B922=\"\",\"\",Food_Reference!B922)","v":""},{"$f":"IF(Food_Reference!C922=\"\",\"\",Food_Reference!C922)","v":""}]
[{"$f":"IF(Food_Reference!A923=\"\",\"\",Food_Reference!A923)","v":""},{"$f":"IF(Food_Reference!B923=\"\",\"\",Food_Reference!B923)","v":""},{"$f":"IF(Food_Reference!C923=\"\",\"\",Food_Reference!C923)","v":""}]
[{"$f":"IF(Food_Reference!A924=\"\",\"\",Food_Reference!A924)","v":""},{"$f":"IF(Food_Reference!B924=\"\",\"\",Food_Reference!B924)","v":""},{"$f":"IF(Food_Reference!C924=\"\",\"\",Food_Reference!C924)","v":""}]
[{"$f":"IF(Food_Reference!A925=\"\",\"\",Food_Reference!A925)","v":""},{"$f":"IF(Food_Reference!B925=\"\",\"\",Food_Reference!B925)","v":""},{"$f":"IF(Food_Reference!C925=\"\",\"\",Food_Reference!C925)","v":""}]
[{"$f":"IF(Food_Reference!A926=\"\",\"\",Food_Reference!A926)","v":""},{"$f":"IF(Food_Reference!B926=\"\",\"\",Food_Reference!B926)","v":""},{"$f":"IF(Food_Reference!C926=\"\",\"\",Food_Reference!C926)","v":""}]
[{"$f":"IF(Food_Reference!A927=\"\",\"\",Food_Reference!A927)","v":""},{"$f":"IF(Food_Reference!B927=\"\",\"\",Food_Reference!B927)","v":""},{"$f":"IF(Food_Reference!C927=\"\",\"\",Food_Reference!C927)","v":""}]
[{"$f":"IF(Food_Reference!A928=\"\",\"\",Food_Reference!A928)","v":""},{"$f":"IF(Food_Reference!B928=\"\",\"\",Food_Reference!B928)","v":""},{"$f":"IF(Food_Reference!C928=\"\",\"\",Food_Reference!C928)","v":""}]
[{"$f":"IF(Food_Reference!A929=\"\",\"\",Food_Reference!A929)","v":""},{"$f":"IF(Food_Reference!B929=\"\",\"\",Food_Reference!B929)","v":""},{"$f":"IF(Food_Reference!C929=\"\",\"\",Food_Reference!C929)","v":""}]
[{"$f":"IF(Food_Reference!A930=\"\",\"\",Food_Reference!A930)","v":""},{"$f":"IF(Food_Reference!B930=\"\",\"\",Food_Reference!B930)","v":""},{"$f":"IF(Food_Reference!C930=\"\",\"\",Food_Reference!C930)","v":""}]
[{"$f":"IF(Food_Reference!A931=\"\",\"\",Food_Reference!A931)","v":""},{"$f":"IF(Food_Reference!B931=\"\",\"\",Food_Reference!B931)","v":""},{"$f":"IF(Food_Reference!C931=\"\",\"\",Food_Reference!C931)","v":""}]
[{"$f":"IF(Food_Reference!A932=\"\",\"\",Food_Reference!A932)","v":""},{"$f":"IF(Food_Reference!B932=\"\",\"\",Food_Reference!B932)","v":""},{"$f":"IF(Food_Reference!C932=\"\",\"\",Food_Reference!C932)","v":""}]
[{"$f":"IF(Food_Reference!A933=\"\",\"\",Food_Reference!A933)","v":""},{"$f":"IF(Food_Reference!B933=\"\",\"\",Food_Reference!B933)","v":""},{"$f":"IF(Food_Reference!C933=\"\",\"\",Food_Reference!C933)","v":""}]
[{"$f":"IF(Food_Reference!A934=\"\",\"\",Food_Reference!A934)","v":""},{"$f":"IF(Food_Reference!B934=\"\",\"\",Food_Reference!B934)","v":""},{"$f":"IF(Food_Reference!C934=\"\",\"\",Food_Reference!C934)","v":""}]
[{"$f":"IF(Food_Reference!A935=\"\",\"\",Food_Reference!A935)","v":""},{"$f":"IF(Food_Reference!B935=\"\",\"\",Food_Reference!B935)","v":""},{"$f":"IF(Food_Reference!C935=\"\",\"\",Food_Reference!C935)","v":""}]
[{"$f":"IF(Food_Reference!A936=\"\",\"\",Food_Reference!A936)","v":""},{"$f":"IF(Food_Reference!B936=\"\",\"\",Food_Reference!B936)","v":""},{"$f":"IF(Food_Reference!C936=\"\",\"\",Food_Reference!C936)","v":""}]
[{"$f":"IF(Food_Reference!A937=\"\",\"\",Food_Reference!A937)","v":""},{"$f":"IF(Food_Reference!B937=\"\",\"\",Food_Reference!B937)","v":""},{"$f":"IF(Food_Reference!C937=\"\",\"\",Food_Reference!C937)","v":""}]
[{"$f":"IF(Food_Reference!A938=\"\",\"\",Food_Reference!A938)","v":""},{"$f":"IF(Food_Reference!B938=\"\",\"\",Food_Reference!B938)","v":""},{"$f":"IF(Food_Reference!C938=\"\",\"\",Food_Reference!C938)","v":""}]
[{"$f":"IF(Food_Reference!A939=\"\",\"\",Food_Reference!A939)","v":""},{"$f":"IF(Food_Reference!B939=\"\",\"\",Food_Reference!B939)","v":""},{"$f":"IF(Food_Reference!C939=\"\",\"\",Food_Reference!C939)","v":""}]
[{"$f":"IF(Food_Reference!A940=\"\",\"\",Food_Reference!A940)","v":""},{"$f":"IF(Food_Reference!B940=\"\",\"\",Food_Reference!B940)","v":""},{"$f":"IF(Food_Reference!C940=\"\",\"\",Food_Reference!C940)","v":""}]
[{"$f":"IF(Food_Reference!A941=\"\",\"\",Food_Reference!A941)","v":""},{"$f":"IF(Food_Reference!B941=\"\",\"\",Food_Reference!B941)","v":""},{"$f":"IF(Food_Reference!C941=\"\",\"\",Food_Reference!C941)","v":""}]
[{"$f":"IF(Food_Reference!A942=\"\",\"\",Food_Reference!A942)","v":""},{"$f":"IF(Food_Reference!B942=\"\",\"\",Food_Reference!B942)","v":""},{"$f":"IF(Food_Reference!C942=\"\",\"\",Food_Reference!C942)","v":""}]
[{"$f":"IF(Food_Reference!A943=\"\",\"\",Food_Reference!A943)","v":""},{"$f":"IF(Food_Reference!B943=\"\",\"\",Food_Reference!B943)","v":""},{"$f":"IF(Food_Reference!C943=\"\",\"\",Food_Reference!C943)","v":""}]
[{"$f":"IF(Food_Reference!A944=\"\",\"\",Food_Reference!A944)","v":""},{"$f":"IF(Food_Reference!B944=\"\",\"\",Food_Reference!B944)","v":""},{"$f":"IF(Food_Reference!C944=\"\",\"\",Food_Reference!C944)","v":""}]
[{"$f":"IF(Food_Reference!A945=\"\",\"\",Food_Reference!A945)","v":""},{"$f":"IF(Food_Reference!B945=\"\",\"\",Food_Reference!B945)","v":""},{"$f":"IF(Food_Reference!C945=\"\",\"\",Food_Reference!C945)","v":""}]
[{"$f":"IF(Food_Reference!A946=\"\",\"\",Food_Reference!A946)","v":""},{"$f":"IF(Food_Reference!B946=\"\",\"\",Food_Reference!B946)","v":""},{"$f":"IF(Food_Reference!C946=\"\",\"\",Food_Reference!C946)","v":""}]
[{"$f":"IF(Food_Reference!A947=\"\",\"\",Food_Reference!A947)","v":""},{"$f":"IF(Food_Reference!B947=\"\",\"\",Food_Reference!B947)","v":""},{"$f":"IF(Food_Reference!C947=\"\",\"\",Food_Reference!C947)","v":""}]
[{"$f":"IF(Food_Reference!A948=\"\",\"\",Food_Reference!A948)","v":""},{"$f":"IF(Food_Reference!B948=\"\",\"\",Food_Reference!B948)","v":""},{"$f":"IF(Food_Reference!C948=\"\",\"\",Food_Reference!C948)","v":""}]
[{"$f":"IF(Food_Reference!A949=\"\",\"\",Food_Reference!A949)","v":""},{"$f":"IF(Food_Reference!B949=\"\",\"\",Food_Reference!B949)","v":""},{"$f":"IF(Food_Reference!C949=\"\",\"\",Food_Reference!C949)","v":""}]
[{"$f":"IF(Food_Reference!A950=\"\",\"\",Food_Reference!A950)","v":""},{"$f":"IF(Food_Reference!B950=\"\",\"\",Food_Reference!B950)","v":""},{"$f":"IF(Food_Reference!C950=\"\",\"\",Food_Reference!C950)","v":""}]
[{"$f":"IF(Food_Reference!A951=\"\",\"\",Food_Reference!A951)","v":""},{"$f":"IF(Food_Reference!B951=\"\",\"\",Food_Reference!B951)","v":""},{"$f":"IF(Food_Reference!C951=\"\",\"\",Food_Reference!C951)","v":""}]
[{"$f":"IF(Food_Reference!A952=\"\",\"\",Food_Reference!A952)","v":""},{"$f":"IF(Food_Reference!B952=\"\",\"\",Food_Reference!B952)","v":""},{"$f":"IF(Food_Reference!C952=\"\",\"\",Food_Reference!C952)","v":""}]
[{"$f":"IF(Food_Reference!A953=\"\",\"\",Food_Reference!A953)","v":""},{"$f":"IF(Food_Reference!B953=\"\",\"\",Food_Reference!B953)","v":""},{"$f":"IF(Food_Reference!C953=\"\",\"\",Food_Reference!C953)","v":""}]
[{"$f":"IF(Food_Reference!A954=\"\",\"\",Food_Reference!A954)","v":""},{"$f":"IF(Food_Reference!B954=\"\",\"\",Food_Reference!B954)","v":""},{"$f":"IF(Food_Reference!C954=\"\",\"\",Food_Reference!C954)","v":""}]
[{"$f":"IF(Food_Reference!A955=\"\",\"\",Food_Reference!A955)","v":""},{"$f":"IF(Food_Reference!B955=\"\",\"\",Food_Reference!B955)","v":""},{"$f":"IF(Food_Reference!C955=\"\",\"\",Food_Reference!C955)","v":""}]
[{"$f":"IF(Food_Reference!A956=\"\",\"\",Food_Reference!A956)","v":""},{"$f":"IF(Food_Reference!B956=\"\",\"\",Food_Reference!B956)","v":""},{"$f":"IF(Food_Reference!C956=\"\",\"\",Food_Reference!C956)","v":""}]
[{"$f":"IF(Food_Reference!A957=\"\",\"\",Food_Reference!A957)","v":""},{"$f":"IF(Food_Reference!B957=\"\",\"\",Food_Reference!B957)","v":""},{"$f":"IF(Food_Reference!C957=\"\",\"\",Food_Reference!C957)","v":""}]
[{"$f":"IF(Food_Reference!A958=\"\",\"\",Food_Reference!A958)","v":""},{"$f":"IF(Food_Reference!B958=\"\",\"\",Food_Reference!B958)","v":""},{"$f":"IF(Food_Reference!C958=\"\",\"\",Food_Reference!C958)","v":""}]
[{"$f":"IF(Food_Reference!A959=\"\",\"\",Food_Reference!A959)","v":""},{"$f":"IF(Food_Reference!B959=\"\",\"\",Food_Reference!B959)","v":""},{"$f":"IF(Food_Reference!C959=\"\",\"\",Food_Reference!C959)","v":""}]
[{"$f":"IF(Food_Reference!A960=\"\",\"\",Food_Reference!A960)","v":""},{"$f":"IF(Food_Reference!B960=\"\",\"\",Food_Reference!B960)","v":""},{"$f":"IF(Food_Reference!C960=\"\",\"\",Food_Reference!C960)","v":""}]
[{"$f":"IF(Food_Reference!A961=\"\",\"\",Food_Reference!A961)","v":""},{"$f":"IF(Food_Reference!B961=\"\",\"\",Food_Reference!B961)","v":""},{"$f":"IF(Food_Reference!C961=\"\",\"\",Food_Reference!C961)","v":""}]
[{"$f":"IF(Food_Reference!A962=\"\",\"\",Food_Reference!A962)","v":""},{"$f":"IF(Food_Reference!B962=\"\",\"\",Food_Reference!B962)","v":""},{"$f":"IF(Food_Reference!C962=\"\",\"\",Food_Reference!C962)","v":""}]
[{"$f":"IF(Food_Reference!A963=\"\",\"\",Food_Reference!A963)","v":""},{"$f":"IF(Food_Reference!B963=\"\",\"\",Food_Reference!B963)","v":""},{"$f":"IF(Food_Reference!C963=\"\",\"\",Food_Reference!C963)","v":""}]
[{"$f":"IF(Food_Reference!A964=\"\",\"\",Food_Reference!A964)","v":""},{"$f":"IF(Food_Reference!B964=\"\",\"\",Food_Reference!B964)","v":""},{"$f":"IF(Food_Reference!C964=\"\",\"\",Food_Reference!C964)","v":""}]
[{"$f":"IF(Food_Reference!A965=\"\",\"\",Food_Reference!A965)","v":""},{"$f":"IF(Food_Reference!B965=\"\",\"\",Food_Reference!B965)","v":""},{"$f":"IF(Food_Reference!C965=\"\",\"\",Food_Reference!C965)","v":""}]
[{"$f":"IF(Food_Reference!A966=\"\",\"\",Food_Reference!A966)","v":""},{"$f":"IF(Food_Reference!B966=\"\",\"\",Food_Reference!B966)","v":""},{"$f":"IF(Food_Reference!C966=\"\",\"\",Food_Reference!C966)","v":""}]
[{"$f":"IF(Food_Reference!A967=\"\",\"\",Food_Reference!A967)","v":""},{"$f":"IF(Food_Reference!B967=\"\",\"\",Food_Reference!B967)","v":""},{"$f":"IF(Food_Reference!C967=\"\",\"\",Food_Reference!C967)","v":""}]
[{"$f":"IF(Food_Reference!A968=\"\",\"\",Food_Reference!A968)","v":""},{"$f":"IF(Food_Reference!B968=\"\",\"\",Food_Reference!B968)","v":""},{"$f":"IF(Food_Reference!C968=\"\",\"\",Food_Reference!C968)","v":""}]
[{"$f":"IF(Food_Reference!A969=\"\",\"\",Food_Reference!A969)","v":""},{"$f":"IF(Food_Reference!B969=\"\",\"\",Food_Reference!B969)","v":""},{"$f":"IF(Food_Reference!C969=\"\",\"\",Food_Reference!C969)","v":""}]
[{"$f":"IF(Food_Reference!A970=\"\",\"\",Food_Reference!A970)","v":""},{"$f":"IF(Food_Reference!B970=\"\",\"\",Food_Reference!B970)","v":""},{"$f":"IF(Food_Reference!C970=\"\",\"\",Food_Reference!C970)","v":""}]
[{"$f":"IF(Food_Reference!A971=\"\",\"\",Food_Reference!A971)","v":""},{"$f":"IF(Food_Reference!B971=\"\",\"\",Food_Reference!B971)","v":""},{"$f":"IF(Food_Reference!C971=\"\",\"\",Food_Reference!C971)","v":""}]
[{"$f":"IF(Food_Reference!A972=\"\",\"\",Food_Reference!A972)","v":""},{"$f":"IF(Food_Reference!B972=\"\",\"\",Food_Reference!B972)","v":""},{"$f":"IF(Food_Reference!C972=\"\",\"\",Food_Reference!C972)","v":""}]

{"sheet":"Food_Reference","index":1,"n_rows":24,"n_cols":3,"rows_kept":24,"cut":false,"hidden":true,"merged":[]}
["Food","Quantity (lbs)","Expiration Date"]
[]
["Apple Slices",5,"2019-12-11"]
["Beans, Refried",5,"2019-12-13"]
["Carrots",5,"2019-12-13"]
["Macaroni",5,"2019-12-13"]
["Oats, Regular",5,"2019-12-13"]
["Potatoes, Instant",5,"2019-12-13"]
["Sugar",5,"2019-12-13"]
["Wheat, Hard White",5,"2019-12-13"]
["Beans, Great Northern",5,"2023-01-04"]
["Cocoa Mix",5,"2023-01-04"]
["Granola (Pouch)",5,"2023-01-04"]
["Milk, Nonfat Dry",5,"2023-01-04"]
["Onions, Dry (#10 Can)",5,"2023-01-04"]
["Peanut Butter",5,"2023-01-04"]
["Rice, White",5,"2023-01-04"]
["Wheat, Hard Red",5,"2023-01-04"]
["Beans, Pinto",5,"2024-03-06"]
["Berry Drink Mix",5,"2024-03-06"]
["Honey (bottle)",5,"2024-03-06"]
["Oats, Quick",5,"2024-03-06"]
["Potatoes, Flakes",5,"2024-03-06"]
["Spaghetti Bites",5,"2024-03-06"]

{"sheet":"Help","index":2,"n_rows":9,"n_cols":1,"rows_kept":9,"cut":false,"hidden":false,"merged":[]}
["Objective"]
["Create a living list of food storage supply. A user may add items, quantities, and expiration dates. A user may also specify items that have been used, which removes the specified quantity or item from the list. "]
[]
["Instructions"]
["To record items in the inventory the user clicks \"Add Food-Item\" or \"Add Non-Food  Item\"."]
["The user starts with a basic list of food and non-food storage items to choose from, but using the userform will allow them to add any item they wish with its shelf life. These items will be added to the list for easier access later."]
["When deleting items the code automatically searches for and deletes the item with the closest expiration date.  "]
["You can order the lists according expiration date, or in alphabetical order."]
["Use the \"Expires in 1 Year\" button to see the name and expiration date of all items set to expire within a year of the current date. "]

{"sheet":"Calcs","index":3,"n_rows":86,"n_cols":6,"rows_kept":86,"cut":false,"hidden":true,"merged":[]}
[]
[null,"Month",null,"Day",null,"Year"]
[null,"Jan",null,1,null,2017]
[null,"Feb",null,2,null,2018]
[null,"Mar",null,3,null,2019]
[null,"Apr",null,4,null,2020]
[null,"May",null,5,null,2021]
[null,"Jun",null,6,null,2022]
[null,"Jul",null,7,null,2023]
[null,"Aug",null,8,null,2024]
[null,"Sep",null,9,null,2025]
[null,"Oct",null,10,null,2026]
[null,"Nov",null,11,null,2027]
[null,"Dec",null,12,null,2028]
[null,null,null,13,null,2029]
[null,null,null,14,null,2030]
[null,null,null,15,null,2031]
[null,null,null,16,null,2032]
[null,null,null,17,null,2033]
[null,null,null,18,null,2034]
[null,null,null,19,null,2035]
[null,null,null,20,null,2036]
[null,null,null,21,null,2037]
[null,null,null,22,null,2038]
[null,null,null,23,null,2039]
[null,null,null,24,null,2040]
[null,null,null,25,null,2041]
[null,null,null,26,null,2042]
[null,null,null,27,null,2043]
[null,null,null,28,null,2044]
[null,null,null,29,null,2045]
[null,null,null,30,null,2046]
[null,null,null,31,null,2047]
[null,null,null,null,null,2048]
[null,null,null,null,null,2049]
[null,null,null,null,null,2050]
[null,null,null,null,null,2051]
[null,null,null,null,null,2052]
[null,null,null,null,null,2053]
[null,null,null,null,null,2054]
[null,null,null,null,null,2055]
[null,null,null,null,null,2056]
[null,null,null,null,null,2057]
[null,null,null,null,null,2058]
[null,null,null,null,null,2059]
[null,null,null,null,null,2060]
[null,null,null,null,null,2061]
[null,null,null,null,null,2062]
[null,null,null,null,null,2063]
[null,null,null,null,null,2064]
[null,null,null,null,null,2065]
[null,null,null,null,null,2066]
[null,null,null,null,null,2067]
[null,null,null,null,null,2068]
[null,null,null,null,null,2069]
[null,null,null,null,null,2070]
[null,null,null,null,null,2071]
[null,null,null,null,null,2072]
[null,null,null,null,null,2073]
[null,null,null,null,null,2074]
[null,null,null,null,null,2075]
[null,null,null,null,null,2076]
[null,null,null,null,null,2077]
[null,null,null,null,null,2078]
[null,null,null,null,null,2079]
[null,null,null,null,null,2080]
[null,null,null,null,null,2081]
[null,null,null,null,null,2082]
[null,null,null,null,null,2083]
[null,null,null,null,null,2084]
[null,null,null,null,null,2085]
[null,null,null,null,null,2086]
[null,null,null,null,null,2087]
[null,null,null,null,null,2088]
[null,null,null,null,null,2089]
[null,null,null,null,null,2090]
[null,null,null,null,null,2091]
[null,null,null,null,null,2092]
[null,null,null,null,null,2093]
[null,null,null,null,null,2094]
[null,null,null,null,null,2095]
[null,null,null,null,null,2096]
[null,null,null,null,null,2097]
[null,null,null,null,null,2098]
[null,null,null,null,null,2099]
[null,null,null,null,null,2100]